Modify

Opened 7 years ago

Closed 7 years ago

Last modified 4 years ago

#9694 closed defect (fixed)

Error compiling compat-wireless in revision 27598 of openWRT

Reported by: hakais@… Owned by: developers
Priority: high Milestone: Barrier Breaker 14.07
Component: packages Version: Trunk
Keywords: compat-wireless mac80211 Cc:

Description

I get this error when trying to compile last openwrt trunk source code for x86 and "PCengines Alix" profile.

make[4]: Entering directory `/home/hitz/13f/x86/build_dir/linux-x86_generic/compat-wireless-2011-06-22'
make -C /home/hitz/13f/x86/build_dir/linux-x86_generic/linux-2.6.32.27 M=/home/hitz/13f/x86/build_dir/linux-x86_generic/compat-wireless-2011-06-22 modules
make[5]: Entering directory `/home/hitz/13f/x86/build_dir/linux-x86_generic/linux-2.6.32.27'
  CC [M]  /home/hitz/13f/x86/build_dir/linux-x86_generic/compat-wireless-2011-06-22/compat/compat_atomic.o
/home/hitz/13f/x86/build_dir/linux-x86_generic/compat-wireless-2011-06-22/compat/compat_atomic.c:7: error: conflicting types for 'atomic64_read'
/home/hitz/13f/x86/build_dir/linux-x86_generic/linux-2.6.32.27/arch/x86/include/asm/atomic_32.h:299: error: previous definition of 'atomic64_read' was here
/home/hitz/13f/x86/build_dir/linux-x86_generic/compat-wireless-2011-06-22/compat/compat_atomic.c:19: error: conflicting types for 'atomic64_add_return'
/home/hitz/13f/x86/build_dir/linux-x86_generic/linux-2.6.32.27/arch/x86/include/asm/atomic_32.h:329: error: previous declaration of 'atomic64_add_return' was here
/home/hitz/13f/x86/build_dir/linux-x86_generic/compat-wireless-2011-06-22/compat/compat_atomic.c:28: error: conflicting types for 'atomic64_add_return'
/home/hitz/13f/x86/build_dir/linux-x86_generic/linux-2.6.32.27/arch/x86/include/asm/atomic_32.h:329: error: previous declaration of 'atomic64_add_return' was here
make[7]: *** [/home/hitz/13f/x86/build_dir/linux-x86_generic/compat-wireless-2011-06-22/compat/compat_atomic.o] Error 1
make[6]: *** [/home/hitz/13f/x86/build_dir/linux-x86_generic/compat-wireless-2011-06-22/compat] Error 2
make[5]: *** [_module_/home/hitz/13f/x86/build_dir/linux-x86_generic/compat-wireless-2011-06-22] Error 2
make[5]: Leaving directory `/home/hitz/13f/x86/build_dir/linux-x86_generic/linux-2.6.32.27'
make[4]: *** [modules] Error 2
make[4]: Leaving directory `/home/hitz/13f/x86/build_dir/linux-x86_generic/compat-wireless-2011-06-22'
make[3]: *** [/home/hitz/13f/x86/build_dir/linux-x86_generic/compat-wireless-2011-06-22/.built] Error 2
make[3]: Leaving directory `/home/hitz/13f/x86/package/mac80211'
make[2]: *** [package/mac80211/compile] Error 2
make[2]: Leaving directory `/home/hitz/13f/x86'
make[1]: *** [/home/hitz/13f/x86/staging_dir/target-i386_uClibc-0.9.30.1/stamp/.package_compile] Error 2
make[1]: Leaving directory `/home/hitz/13f/x86'
make: *** [world] Error 2

Attachments (0)

Change History (2)

comment:1 Changed 7 years ago by nbd

  • Resolution set to fixed
  • Status changed from new to closed

fixed in r27606

comment:2 Changed 4 years ago by jow

  • Milestone changed from Attitude Adjustment 12.09 to Barrier Breaker 14.07

Milestone Attitude Adjustment 12.09 deleted

Add Comment

Modify Ticket

Action
as closed .
The resolution will be deleted. Next status will be 'reopened'.
Author


E-mail address and user name can be saved in the Preferences.

 
Note: See TracTickets for help on using tickets.