Modify

Opened 7 years ago

Last modified 4 years ago

#9679 new defect

Trunk compile failed at "make[3] -C feeds/packages/libs/libcrypto++ compile"

Reported by: anonymous Owned by: developers
Priority: normal Milestone: Barrier Breaker 14.07
Component: packages Version: Trunk
Keywords: Cc:

Description

Libcrypto++ is needed to build aMule.

Revision: 27559
make log:

make[4]: Entering directory `/home/ylxu/lab/kamikaze/trunk/build_dir/target-mips_r2_uClibc-0.9.32/libcrypto++-5.6.0'
mips-openwrt-linux-uclibc-g++ -DNDEBUG -g -O2 -DCRYPTOPP_DISABLE_ASM -pipe -c bench2.cpp
bench2.cpp: In function 'void BenchmarkAll2(double, double)':
bench2.cpp:248:38: error: 'PACKAGE_DATA_DIR' was not declared in this scope
bench2.cpp:249:55: error: expected ')' before string constant
bench2.cpp:250:45: error: expected ')' before string constant
bench2.cpp:251:47: error: expected ')' before string constant
bench2.cpp:254:55: error: expected ')' before string constant
bench2.cpp:255:55: error: expected ')' before string constant
bench2.cpp:256:45: error: expected ')' before string constant
bench2.cpp:257:47: error: expected ')' before string constant
bench2.cpp:260:57: error: expected ')' before string constant
bench2.cpp:261:56: error: expected ')' before string constant
bench2.cpp:262:57: error: expected ')' before string constant
bench2.cpp:263:48: error: expected ')' before string constant
bench2.cpp:264:43: error: expected ')' before string constant
bench2.cpp:265:53: error: expected ')' before string constant
bench2.cpp:266:51: error: expected ')' before string constant
bench2.cpp:267:51: error: expected ')' before string constant
bench2.cpp:270:57: error: expected ')' before string constant
bench2.cpp:271:56: error: expected ')' before string constant
bench2.cpp:272:57: error: expected ')' before string constant
bench2.cpp:273:48: error: expected ')' before string constant
bench2.cpp:274:53: error: expected ')' before string constant
bench2.cpp:275:51: error: expected ')' before string constant
bench2.cpp:278:49: error: expected ')' before string constant
bench2.cpp:279:49: error: expected ')' before string constant
bench2.cpp:280:45: error: expected ')' before string constant
bench2.cpp:281:45: error: expected ')' before string constant
bench2.cpp:282:49: error: expected ')' before string constant
bench2.cpp:283:49: error: expected ')' before string constant
bench2.cpp:284:46: error: expected ')' before string constant
bench2.cpp:285:46: error: expected ')' before string constant
make[4]: *** [bench2.o] Error 1
make[4]: Leaving directory `/home/ylxu/lab/kamikaze/trunk/build_dir/target-mips_r2_uClibc-0.9.32/libcrypto++-5.6.0'
make[3]: *** [/home/ylxu/lab/kamikaze/trunk/build_dir/target-mips_r2_uClibc-0.9.32/libcrypto++-5.6.0/.built] Error 2
make[3]: Leaving directory `/home/ylxu/lab/kamikaze/trunk/feeds/packages/libs/libcrypto++'
make[2]: *** [package/feeds/packages/libcrypto++/compile] Error 2
make[2]: Leaving directory `/home/ylxu/lab/kamikaze/trunk'
make[1]: *** [/home/ylxu/lab/kamikaze/trunk/staging_dir/target-mips_r2_uClibc-0.9.32/stamp/.package_compile] Error 2
make[1]: Leaving directory `/home/ylxu/lab/kamikaze/trunk'
make: *** [world] Error 2

Attachments (0)

Change History (2)

comment:1 Changed 7 years ago by openwrt@…

Confirmed, just failed for me too.

comment:2 Changed 4 years ago by jow

  • Milestone changed from Attitude Adjustment 12.09 to Barrier Breaker 14.07

Milestone Attitude Adjustment 12.09 deleted

Add Comment

Modify Ticket

Action
as new .
Author


E-mail address and user name can be saved in the Preferences.

 
Note: See TracTickets for help on using tickets.