Modify

Opened 7 years ago

Last modified 4 years ago

#8874 new defect

[ImageBuilder orion] Missing files

Reported by: Nilfred <nilfred@…> Owned by: developers
Priority: normal Milestone: Barrier Breaker 14.07
Component: packages Version: Trunk
Keywords: imagebuilder orion r25530 Cc:

Description

make image

...
Package iptables (1.4.10-1) installed in root is up to date.
Package kernel (2.6.37-1) installed in root is up to date.
...
Unknown package 'kmod-crypto-mv-cesa'.
...
Collected errors:
 * satisfy_dependencies_for: Cannot satisfy the following dependencies for kmod-ath9k:
 * 	kmod-crypto-aes * 
 * opkg_install_cmd: Cannot install package kmod-crypto-mv-cesa.
...
make[2]: *** [package_install] Error 255
make[2]: Leaving directory `...'
make[1]: *** [_call_image] Error 2
make[1]: Leaving directory `...'
make: *** [image] Error 2

make image PACKAGES="-kmod-ath -kmod-ath9k -kmod-crypto-mv-cesa kmod-mwl8k uhttpd"

...
Package iptables (1.4.10-1) installed in root is up to date.
Package kernel (2.6.37-1) installed in root is up to date.
...
Building images...
make V=99 -C target/linux/orion/image install TARGET_BUILD=1 IB=1
# Orion Kernel uImages
echo -en "\x06\x1c\xa0\xe3\x61\x10\x81\xe3" > ~/OpenWrt-ImageBuilder-orion-for-Linux-x86_64/build_dir/linux-orion_generic/wrt350nv2-zImage
cat ~/OpenWrt-ImageBuilder-orion-for-Linux-x86_64/build_dir/linux-orion_generic/linux-2.6.37/arch/arm/boot/zImage >> ~/OpenWrt-ImageBuilder-orion-for-Linux-x86_64/build_dir/linux-orion_generic/wrt350nv2-zImage
cat: ~/OpenWrt-ImageBuilder-orion-for-Linux-x86_64/build_dir/linux-orion_generic/linux-2.6.37/arch/arm/boot/zImage: No such file or directory
make[3]: *** [install] Error 1
make[3]: Leaving directory `...'
make[2]: *** [build_image] Error 2
make[2]: Leaving directory `...'
make[1]: *** [_call_image] Error 2
make[1]: Leaving directory `...'
make: *** [image] Error 2

No zImage nor available for download, stuck here. So close!?

Attachments (0)

Change History (2)

comment:1 Changed 7 years ago by Nilfred <nilfred@…>

The list keeps growing in r26185:

make image
...
Unknown package 'coreutils'.
...
Unknown package 'kmod-crypto-mv-cesa'.
...
Collected errors:
 * opkg_install_cmd: Cannot install package coreutils.
 * satisfy_dependencies_for: Cannot satisfy the following dependencies for kmod-ath9k:
 * 	kmod-crypto-aes * 
 * opkg_install_cmd: Cannot install package kmod-crypto-mv-cesa.

So as usual:

make image PACKAGES="-kmod-ath -kmod-ath9k -kmod-crypto-mv-cesa -coreutils"
...
Building images...
make V=99 -C target/linux/orion/image install TARGET_BUILD=1 IB=1
...
# Orion Kernel uImages
echo -en "\x06\x1c\xa0\xe3\x61\x10\x81\xe3" > ~/build/OpenWrt-ImageBuilder-orion-for-Linux-x86_64/build_dir/linux-orion_generic/wrt350nv2-zImage
cat ~/build/OpenWrt-ImageBuilder-orion-for-Linux-x86_64/build_dir/linux-orion_generic/linux-2.6.37.3/arch/arm/boot/zImage >> ~/build/OpenWrt-ImageBuilder-orion-for-Linux-x86_64/build_dir/linux-orion_generic/wrt350nv2-zImage
cat: ~/build/OpenWrt-ImageBuilder-orion-for-Linux-x86_64/build_dir/linux-orion_generic/linux-2.6.37.3/arch/arm/boot/zImage: No such file or directory
  • build_dir/linux-orion_generic/linux-2.6.37.3/arch/arm/boot/zImage
  • package coreutils
  • package kmod-crypto-mv-cesa
  • package kmod-crypto-aes

comment:2 Changed 4 years ago by jow

  • Milestone changed from Attitude Adjustment 12.09 to Barrier Breaker 14.07

Milestone Attitude Adjustment 12.09 deleted

Add Comment

Modify Ticket

Action
as new .
Author


E-mail address and user name can be saved in the Preferences.

 
Note: See TracTickets for help on using tickets.