Modify

Opened 7 years ago

Last modified 7 years ago

#8456 new defect

Luci build failed

Reported by: yellowbug Owned by:
Priority: normal Milestone:
Component: luci Version: Trunk
Keywords: luci iwinfo Cc:

Description

r24564, AR71xx platform. luci-app-olsr-viz is the only package ticked. other package are selected as dependance

Here's the error output

mips-openwrt-linux-uclibc-gcc -Os -pipe -mips32r2 -mtune=mips32r2 -funit-at-a-time -fhonour-copts -msoft-float -I/var/www/pub/sam/kamikaze-svn/ubnt_nsm2-r24564/staging_dir/target-mips_r2_uClibc-0.9.31/usr/include/libnl-tiny -I/var/www/pub/sam/kamikaze-svn/ubnt_nsm2-r24564/staging_dir/target-mips_r2_uClibc-0.9.31/usr/include -std=gnu99 -fstrict-aliasing -DUSE_MADWIFI -DUSE_NL80211 -fpic -c -o iwinfo_utils.o iwinfo_utils.c
In file included from iwinfo.h:32,

from iwinfo_utils.h:25,
from iwinfo_utils.c:23:

iwinfo_nl80211.h:29:29: error: netlink/netlink.h: No such file or directory
iwinfo_nl80211.h:30:31: error: netlink/genl/genl.h: No such file or directory
iwinfo_nl80211.h:31:33: error: netlink/genl/family.h: No such file or directory
iwinfo_nl80211.h:32:31: error: netlink/genl/ctrl.h: No such file or directory
make[4]: * [iwinfo_utils.o] Error 1
make[4]: Leaving directory `/var/www/pub/sam/kamikaze-svn/ubnt_nsm2-r24564/build_dir/target-mips_r2_uClibc-0.9.31/libiwinfo'
make[3]:
* /var/www/pub/sam/kamikaze-svn/ubnt_nsm2-r24564/build_dir/target-mips_r2_uClibc-0.9.31/libiwinfo/.built Error 2
make[3]: Leaving directory `/var/www/pub/sam/kamikaze-svn/ubnt_nsm2-r24564/feeds/luci/iwinfo'
make[2]: * [package/feeds/luci/iwinfo/compile] Error 2
make[2]: Leaving directory `/var/www/pub/sam/kamikaze-svn/ubnt_nsm2-r24564'
make[1]:
* /var/www/pub/sam/kamikaze-svn/ubnt_nsm2-r24564/staging_dir/target-mips_r2_uClibc-0.9.31/stamp/.package_compile Error 2
make[1]: Leaving directory `/var/www/pub/sam/kamikaze-svn/ubnt_nsm2-r24564'
make: * [world] Error 2

Attachments (0)

Change History (5)

comment:1 follow-up: Changed 7 years ago by anonymous

manually type once:
make package/libnl-tiny/compile

then it will continue build

comment:2 in reply to: ↑ 1 Changed 7 years ago by yellowbug@…

Great thanks, it works. Hope it can be fixed in the comming 10.03.1 release.

Replying to anonymous:

manually type once:
make package/libnl-tiny/compile

then it will continue build

comment:3 Changed 7 years ago by alexander@…

confirm it

comment:4 Changed 7 years ago by aguler@…

I see the same problem in trunk (rev 6791). Following patch is fixing it:
diff --git a/iwinfo/Makefile b/iwinfo/Makefile
index c890910..be0b92b 100644
--- a/iwinfo/Makefile
+++ b/iwinfo/Makefile
@@ -19,7 +19,7 @@ define Package/libiwinfo

CATEGORY:=LuCI
SUBMENU:=Libraries
TITLE:=Generalized Wireless Information Library (iwinfo)

  • DEPENDS:=+PACKAGE_kmod-mac80211:libnl-tiny +liblua +lua

+ DEPENDS:=+PACKAGE_kmod-mac80211 +libnl-tiny +liblua +lua

DEFAULT:=PACKAGE_luci-lib-sys

endef


comment:5 Changed 7 years ago by tubaman@…

This is actually a bug in LuCI since it's in a package in the LuCI feed

Add Comment

Modify Ticket

Action
as new .
Author


E-mail address and user name can be saved in the Preferences.

 
Note: See TracTickets for help on using tickets.