Modify

Opened 7 years ago

Closed 7 years ago

#8424 closed defect (fixed)

libtool-2.4 compile error on ORION

Reported by: anonymous Owned by: developers
Priority: high Milestone:
Component: packages Version: Trunk
Keywords: LIBTOOL ORION Cc:

Description

After all the new patches a new compile problem comes up with libtool-2.4:

make[7]: Leaving directory `/home/openwrt/orion-trunk-2.6.36/build_dir/target-arm_v5t_uClibc-0.9.31_eabi/libtool-2.4'
make[6]: Leaving directory `/home/openwrt/orion-trunk-2.6.36/build_dir/target-arm_v5t_uClibc-0.9.31_eabi/libtool-2.4'
make[5]: Leaving directory `/home/openwrt/orion-trunk-2.6.36/build_dir/target-arm_v5t_uClibc-0.9.31_eabi/libtool-2.4'
make[4]: Leaving directory `/home/openwrt/orion-trunk-2.6.36/build_dir/target-arm_v5t_uClibc-0.9.31_eabi/libtool-2.4'
install -d -m0755 /home/openwrt/orion-trunk-2.6.36/tmp/stage-libtool/usr/lib /home/openwrt/orion-trunk-2.6.36/tmp/stage-libtool/usr/include
mv /home/openwrt/orion-trunk-2.6.36/tmp/stage-libtool/host/lib/* /home/openwrt/orion-trunk-2.6.36/tmp/stage-libtool/usr/lib/
mv /home/openwrt/orion-trunk-2.6.36/tmp/stage-libtool/host/include/* /home/openwrt/orion-trunk-2.6.36/tmp/stage-libtool/usr/include/
/home/openwrt/orion-trunk-2.6.36/staging_dir/host/bin/sed -i -e 's,\(hardcode_into_libs\)=yes,\1=no,g' /home/openwrt/orion-trunk-2.6.36/tmp/stage-libtool/host/bin/libtool
cp -fpR /home/openwrt/orion-trunk-2.6.36/tmp/stage-libtool/host/bin/libtool /home/openwrt/orion-trunk-2.6.36/tmp/stage-libtool/host/bin/libtool-ucxx
/home/openwrt/orion-trunk-2.6.36/staging_dir/host/bin/sed -i -e 's,-lstdc++,-luClibc++,g' /home/openwrt/orion-trunk-2.6.36/tmp/stage-libtool/host/bin/libtool-ucxx
find /home/openwrt/orion-trunk-2.6.36/tmp/stage-libtool -name '*.la' | xargs -r rm -f;
if [ -d /home/openwrt/orion-trunk-2.6.36/tmp/stage-libtool ]; then (cd /home/openwrt/orion-trunk-2.6.36/tmp/stage-libtool; find ./ > /home/openwrt/orion-trunk-2.6.36/tmp/stage-libtool.files);      SHELL= /home/openwrt/orion-trunk-2.6.36/staging_dir/host/bin/flock /home/openwrt/orion-trunk-2.6.36/tmp/.staging-dir.flock -c ' mv /home/openwrt/orion-trunk-2.6.36/tmp/stage-libtool.files /home/openwrt/orion-trunk-2.6.36/staging_dir/target-arm_v5t_uClibc-0.9.31_eabi/packages/libtool.list && cp -fpR /home/openwrt/orion-trunk-2.6.36/tmp/stage-libtool/* /home/openwrt/orion-trunk-2.6.36/staging_dir/target-arm_v5t_uClibc-0.9.31_eabi/; '; fi
cp: cannot overwrite non-directory `/home/openwrt/orion-trunk-2.6.36/staging_dir/target-arm_v5t_uClibc-0.9.31_eabi/host/share/aclocal' with directory `/home/openwrt/orion-trunk-2.6.36/tmp/stage-libtool/host/share/aclocal'
make[3]: *** [/home/openwrt/orion-trunk-2.6.36/staging_dir/target-arm_v5t_uClibc-0.9.31_eabi/stamp/.libtool_installed] Error 1
make[3]: Leaving directory `/home/openwrt/orion-trunk-2.6.36/package/libtool'
make[2]: *** [package/libtool/compile] Error 2
make[2]: Leaving directory `/home/openwrt/orion-trunk-2.6.36'
make[1]: *** [/home/openwrt/orion-trunk-2.6.36/staging_dir/target-arm_v5t_uClibc-0.9.31_eabi/stamp/.package_compile] Error 2
make[1]: Leaving directory `/home/openwrt/orion-trunk-2.6.36'
make: *** [world] Error 2
openwrt@develope:~/orion-trunk-2.6.36$

Attachments (0)

Change History (2)

comment:1 Changed 7 years ago by buildster

I just had this problem, too, and it stopped my build of kirkwood quite early.

comment:2 Changed 7 years ago by jow

  • Resolution set to fixed
  • Status changed from new to closed

Should be fixed with r24470

Add Comment

Modify Ticket

Action
as closed .
The resolution will be deleted. Next status will be 'reopened'.
Author


E-mail address and user name can be saved in the Preferences.

 
Note: See TracTickets for help on using tickets.