Modify

Opened 12 years ago

Closed 12 years ago

Last modified 4 years ago

#8 closed defect (fixed)

Build of openswan kernel module fails on 2.6/mipsel

Reported by: nico Owned by: nbd
Priority: normal Milestone: Barrier Breaker 14.07
Component: kernel Version: 2.0
Keywords: kmod openswan Cc:

Description

Build of openswan kernel module fails on 2.6/mipsel with assembler error messages:

./build_mipsel/linux-2.6-brcm/openswan-2.4.0/modobj26/ipsec_sa.s:1479: Error: opcode not supported on this processor: mips1 (mips1) `ll $2,4($16)'
./build_mipsel/linux-2.6-brcm/openswan-2.4.0/modobj26/ipsec_sa.s:1481: Error: opcode not supported on this processor: mips1 (mips1) `sc $2,4($16)'

A detailled error log will follow.

Attachments (0)

Change History (4)

comment:1 Changed 12 years ago by nico

Detailled log of the error:

make -C /home/projects/openwrt/branches/trunk/test-mipsel-2.6/build_mipsel/linux-2.6-brcm/linux-2.6.12.5  BUILDDIR=/home/projects/openwrt/branches/trunk/test-mipsel-2.6/build_mipsel/linux-2.6-brcm/openswan-2.4.0/modobj26 SUBDIRS=/home/projects/openwrt/branches/trunk/test-mipsel-2.6/build_mipsel/linux-2.6-brcm/openswan-2.4.0/modobj26 MODULE_DEF_INCLUDE=/home/projects/openwrt/branches/trunk/test-mipsel-2.6/build_mipsel/linux-2.6-brcm/openswan-2.4.0/packaging/linus/config-all.h MODULE_DEFCONFIG=/home/projects/openwrt/branches/trunk/test-mipsel-2.6/build_mipsel/linux-2.6-brcm/openswan-2.4.0/linux/net/ipsec/defconfig ARCH=mips modules
make[11]: Entering directory `/home/projects/openwrt/branches/trunk/test-mipsel-2.6/build_mipsel/linux-2.6-brcm/linux-2.6.12.5'
ln -s -f /home/projects/openwrt/branches/trunk/test-mipsel-2.6/build_mipsel/linux-2.6-brcm/openswan-2.4.0/linux/net/ipsec/ipsec_init.c /home/projects/openwrt/branches/trunk/test-mipsel-2.6/build_mipsel/linux-2.6-brcm/openswan-2.4.0/modobj26/ipsec_init.c
  CC [M]  /home/projects/openwrt/branches/trunk/test-mipsel-2.6/build_mipsel/linux-2.6-brcm/openswan-2.4.0/modobj26/ipsec_init.s
/home/projects/openwrt/branches/trunk/test-mipsel-2.6/staging_dir_mipsel/bin/mipsel-linux-uclibc-as   -o /home/projects/openwrt/branches/trunk/test-mipsel-2.6/build_mipsel/linux-2.6-brcm/openswan-2.4.0/modobj26/ipsec_init.o /home/projects/openwrt/branches/trunk/test-mipsel-2.6/build_mipsel/linux-2.6-brcm/openswan-2.4.0/modobj26/ipsec_init.s
ln -s -f /home/projects/openwrt/branches/trunk/test-mipsel-2.6/build_mipsel/linux-2.6-brcm/openswan-2.4.0/linux/net/ipsec/ipsec_sa.c /home/projects/openwrt/branches/trunk/test-mipsel-2.6/build_mipsel/linux-2.6-brcm/openswan-2.4.0/modobj26/ipsec_sa.c
  CC [M]  /home/projects/openwrt/branches/trunk/test-mipsel-2.6/build_mipsel/linux-2.6-brcm/openswan-2.4.0/modobj26/ipsec_sa.s
/home/projects/openwrt/branches/trunk/test-mipsel-2.6/staging_dir_mipsel/bin/mipsel-linux-uclibc-as   -o /home/projects/openwrt/branches/trunk/test-mipsel-2.6/build_mipsel/linux-2.6-brcm/openswan-2.4.0/modobj26/ipsec_sa.o /home/projects/openwrt/branches/trunk/test-mipsel-2.6/build_mipsel/linux-2.6-brcm/openswan-2.4.0/modobj26/ipsec_sa.s
/home/projects/openwrt/branches/trunk/test-mipsel-2.6/build_mipsel/linux-2.6-brcm/openswan-2.4.0/modobj26/ipsec_sa.s: Assembler messages:
/home/projects/openwrt/branches/trunk/test-mipsel-2.6/build_mipsel/linux-2.6-brcm/openswan-2.4.0/modobj26/ipsec_sa.s:1479: Error: opcode not supported on this processor: mips1 (mips1) `ll $2,4($16)'
/home/projects/openwrt/branches/trunk/test-mipsel-2.6/build_mipsel/linux-2.6-brcm/openswan-2.4.0/modobj26/ipsec_sa.s:1481: Error: opcode not supported on this processor: mips1 (mips1) `sc $2,4($16)'
/home/projects/openwrt/branches/trunk/test-mipsel-2.6/build_mipsel/linux-2.6-brcm/openswan-2.4.0/modobj26/ipsec_sa.s:1709: Error: opcode not supported on this processor: mips1 (mips1) `ll $2,4($4)'
/home/projects/openwrt/branches/trunk/test-mipsel-2.6/build_mipsel/linux-2.6-brcm/openswan-2.4.0/modobj26/ipsec_sa.s:1711: Error: opcode not supported on this processor: mips1 (mips1) `sc $2,4($4)'
/home/projects/openwrt/branches/trunk/test-mipsel-2.6/build_mipsel/linux-2.6-brcm/openswan-2.4.0/modobj26/ipsec_sa.s:1892: Error: opcode not supported on this processor: mips1 (mips1) `ll $2,4($16)'
/home/projects/openwrt/branches/trunk/test-mipsel-2.6/build_mipsel/linux-2.6-brcm/openswan-2.4.0/modobj26/ipsec_sa.s:1894: Error: opcode not supported on this processor: mips1 (mips1) `sc $2,4($16)'
/home/projects/openwrt/branches/trunk/test-mipsel-2.6/build_mipsel/linux-2.6-brcm/openswan-2.4.0/modobj26/ipsec_sa.s:1996: Error: opcode not supported on this processor: mips1 (mips1) `ll $2,4($7)'
/home/projects/openwrt/branches/trunk/test-mipsel-2.6/build_mipsel/linux-2.6-brcm/openswan-2.4.0/modobj26/ipsec_sa.s:1998: Error: opcode not supported on this processor: mips1 (mips1) `sc $2,4($7)'
/home/projects/openwrt/branches/trunk/test-mipsel-2.6/build_mipsel/linux-2.6-brcm/openswan-2.4.0/modobj26/ipsec_sa.s:2273: Error: opcode not supported on this processor: mips1 (mips1) `ll $2,4($16)'
/home/projects/openwrt/branches/trunk/test-mipsel-2.6/build_mipsel/linux-2.6-brcm/openswan-2.4.0/modobj26/ipsec_sa.s:2275: Error: opcode not supported on this processor: mips1 (mips1) `sc $2,4($16)'
/home/projects/openwrt/branches/trunk/test-mipsel-2.6/build_mipsel/linux-2.6-brcm/openswan-2.4.0/modobj26/ipsec_sa.s:2329: Error: opcode not supported on this processor: mips1 (mips1) `ll $2,4($4)'
/home/projects/openwrt/branches/trunk/test-mipsel-2.6/build_mipsel/linux-2.6-brcm/openswan-2.4.0/modobj26/ipsec_sa.s:2331: Error: opcode not supported on this processor: mips1 (mips1) `sc $2,4($4)'
/home/projects/openwrt/branches/trunk/test-mipsel-2.6/build_mipsel/linux-2.6-brcm/openswan-2.4.0/modobj26/ipsec_sa.s:2955: Error: opcode not supported on this processor: mips1 (mips1) `ll $2,4($18)'
/home/projects/openwrt/branches/trunk/test-mipsel-2.6/build_mipsel/linux-2.6-brcm/openswan-2.4.0/modobj26/ipsec_sa.s:2957: Error: opcode not supported on this processor: mips1 (mips1) `sc $2,4($18)'
/home/projects/openwrt/branches/trunk/test-mipsel-2.6/build_mipsel/linux-2.6-brcm/openswan-2.4.0/modobj26/ipsec_sa.s:2986: Error: opcode not supported on this processor: mips1 (mips1) `ll $2,4($17)'
/home/projects/openwrt/branches/trunk/test-mipsel-2.6/build_mipsel/linux-2.6-brcm/openswan-2.4.0/modobj26/ipsec_sa.s:2988: Error: opcode not supported on this processor: mips1 (mips1) `sc $2,4($17)'
/home/projects/openwrt/branches/trunk/test-mipsel-2.6/build_mipsel/linux-2.6-brcm/openswan-2.4.0/modobj26/ipsec_sa.s:3374: Error: opcode not supported on this processor: mips1 (mips1) `ll $2,4($17)'
/home/projects/openwrt/branches/trunk/test-mipsel-2.6/build_mipsel/linux-2.6-brcm/openswan-2.4.0/modobj26/ipsec_sa.s:3376: Error: opcode not supported on this processor: mips1 (mips1) `sc $2,4($17)'
/home/projects/openwrt/branches/trunk/test-mipsel-2.6/build_mipsel/linux-2.6-brcm/openswan-2.4.0/modobj26/ipsec_sa.s:3451: Error: opcode not supported on this processor: mips1 (mips1) `ll $2,4($17)'
/home/projects/openwrt/branches/trunk/test-mipsel-2.6/build_mipsel/linux-2.6-brcm/openswan-2.4.0/modobj26/ipsec_sa.s:3453: Error: opcode not supported on this processor: mips1 (mips1) `sc $2,4($17)'
make[12]: *** [/home/projects/openwrt/branches/trunk/test-mipsel-2.6/build_mipsel/linux-2.6-brcm/openswan-2.4.0/modobj26/ipsec_sa.o] Error 1
make[11]: *** [_module_/home/projects/openwrt/branches/trunk/test-mipsel-2.6/build_mipsel/linux-2.6-brcm/openswan-2.4.0/modobj26] Error 2
make[11]: Leaving directory `/home/projects/openwrt/branches/trunk/test-mipsel-2.6/build_mipsel/linux-2.6-brcm/linux-2.6.12.5'
make[10]: *** [module26] Error 2
make[10]: Leaving directory `/home/projects/openwrt/branches/trunk/test-mipsel-2.6/build_mipsel/linux-2.6-brcm/openswan-2.4.0'
make[9]: *** [module] Error 2
make[9]: Leaving directory `/home/projects/openwrt/branches/trunk/test-mipsel-2.6/build_mipsel/linux-2.6-brcm/openswan-2.4.0'
make[8]: *** [/home/projects/openwrt/branches/trunk/test-mipsel-2.6/build_mipsel/linux-2.6-brcm/openswan-2.4.0/.built] Error 2
make[8]: Leaving directory `/home/projects/openwrt/branches/trunk/test-mipsel-2.6/target/linux/package/openswan'
make[7]: *** [compile] Error 2
make[7]: Leaving directory `/home/projects/openwrt/branches/trunk/test-mipsel-2.6/target/linux/package/openswan'
make[6]: *** [openswan-compile] Error 2
make[6]: Leaving directory `/home/projects/openwrt/branches/trunk/test-mipsel-2.6/target/linux/package'
make[5]: *** [/home/projects/openwrt/branches/trunk/test-mipsel-2.6/build_mipsel/stamp/.linux-compile] Error 2
make[5]: Leaving directory `/home/projects/openwrt/branches/trunk/test-mipsel-2.6/target/linux/linux-2.6'
make[4]: *** [compile] Error 2
make[4]: Leaving directory `/home/projects/openwrt/branches/trunk/test-mipsel-2.6/target/linux/linux-2.6'
make[3]: *** [2.6/brcm-compile] Error 2
make[3]: Leaving directory `/home/projects/openwrt/branches/trunk/test-mipsel-2.6/target/linux'
make[2]: *** [linux-compile] Error 2
make[2]: Leaving directory `/home/projects/openwrt/branches/trunk/test-mipsel-2.6/target'
make[1]: *** [target/compile] Error 2
make[1]: Leaving directory `/home/projects/openwrt/branches/trunk/test-mipsel-2.6'
make: *** [world] Error 2

comment:2 Changed 12 years ago by nbd

  • Owner changed from developers to nbd
  • Status changed from new to assigned

comment:3 Changed 12 years ago by nbd

  • Resolution set to fixed
  • Status changed from assigned to closed

comment:4 Changed 4 years ago by jow

  • Milestone changed from Attitude Adjustment 12.09 to Barrier Breaker 14.07

Milestone Attitude Adjustment 12.09 deleted

Add Comment

Modify Ticket

Action
as closed .
The resolution will be deleted. Next status will be 'reopened'.
Author


E-mail address and user name can be saved in the Preferences.

 
Note: See TracTickets for help on using tickets.