Modify

Opened 8 years ago

Closed 6 years ago

Last modified 4 years ago

#6089 closed defect (obsolete)

samba3 compile fail with svn trunk for ixp4xx

Reported by: anonymous Owned by: developers
Priority: normal Milestone: Barrier Breaker 14.07
Component: packages Version: Trunk
Keywords: samba3 ixp4xx Cc:

Description

svn trunk version: Kamikaze (r18274)

The base system compiles correctly, but attempt to build samba3 package fails when linking with the following error:

Linking bin/smbd
armeb-openwrt-linux-uclibcgnueabi-gcc  -Os -pipe -march=armv5te -mtune=xscale -funit-at-a-time -fhonour-copts -msoft-float -DSAMBA_DEBUG -Os -D_SAMBA_BUILD_ -DAVM_NO_PRINTING -DAVM_SMALLER -I./popt -Iinclude -I`pwd`/include -I`pwd`/ubiqx  -I. -I/Volumes/openwrt/openwrt/trunk/staging_dir/target-armeb_uClibc-0.9.30.1/usr/include -I/Volumes/openwrt/openwrt/trunk/staging_dir/target-armeb_uClibc-0.9.30.1/include -I/Volumes/openwrt/openwrt/trunk/staging_dir/toolchain-armeb_gcc-4.3.3+cs_uClibc-0.9.30.1/usr/include -I/Volumes/openwrt/openwrt/trunk/staging_dir/toolchain-armeb_gcc-4.3.3+cs_uClibc-0.9.30.1/include -D_GNU_SOURCE -I`pwd` -I`pwd`/tdb      -o bin/smbd smbd/server.o -L/Volumes/openwrt/openwrt/trunk/staging_dir/target-armeb_uClibc-0.9.30.1/usr/lib -L/Volumes/openwrt/openwrt/trunk/staging_dir/target-armeb_uClibc-0.9.30.1/lib -L/Volumes/openwrt/openwrt/trunk/staging_dir/toolchain-armeb_gcc-4.3.3+cs_uClibc-0.9.30.1/usr/lib -L/Volumes/openwrt/openwrt/trunk/staging_dir/toolchain-armeb_gcc-4.3.3+cs_uClibc-0.9.30.1/lib \
		-lcrypt  \
		-Lbin -lsmbd \
		-L/lib \
		-lcrypt -ldl -lpthread
bin/libsmbd.a: could not read symbols: Archive has no index; run ranlib to add one
collect2: ld returned 1 exit status
make[4]: *** [bin/smbd] Error 1
make[3]: *** [/Volumes/openwrt/openwrt/trunk/build_dir/target-armeb_uClibc-0.9.30.1/samba-3.0.24//.built] Error 2
make[2]: *** [package/feeds/packages/samba3/compile] Error 2
make[1]: *** [/Volumes/openwrt/openwrt/trunk/staging_dir/target-armeb_uClibc-0.9.30.1/stamp/.package_compile] Error 2
make: *** [world] Error 2

Attachments (0)

Change History (4)

comment:1 Changed 8 years ago by anonymous

Should probably add the build system is Snow Leopard with the latest Xcode (gcc 4.2.1)

comment:2 Changed 8 years ago by anonymous

I have the same problem with the latest trunk. I also use snow leopard.

comment:3 Changed 6 years ago by nbd

  • Resolution set to obsolete
  • Status changed from new to closed

old samba packages have been replaced by samba36

comment:4 Changed 4 years ago by jow

  • Milestone changed from Attitude Adjustment 12.09 to Barrier Breaker 14.07

Milestone Attitude Adjustment 12.09 deleted

Add Comment

Modify Ticket

Action
as closed .
The resolution will be deleted. Next status will be 'reopened'.
Author


E-mail address and user name can be saved in the Preferences.

 
Note: See TracTickets for help on using tickets.