Modify

Opened 8 years ago

Closed 8 years ago

Last modified 4 years ago

#5940 closed defect (fixed)

xtables-addons compilation error

Reported by: telstar924@… Owned by: developers
Priority: highest Milestone: Barrier Breaker 14.07
Component: packages Version: Trunk
Keywords: Cc:

Description

X86 platform (trunk)
make[4]: Entering directory `/mnt/sda1/trunk/build_dir/linux-x86_generic/xtables-addons-1.17'
make all-recursive
make[5]: Entering directory `/mnt/sda1/trunk/build_dir/linux-x86_generic/xtables-addons-1.17'
Making all in extensions
make[6]: Entering directory `/mnt/sda1/trunk/build_dir/linux-x86_generic/xtables-addons-1.17/extensions'

GEN modules

make[7]: Entering directory `/mnt/sda1/trunk/build_dir/linux-x86_generic/linux-2.6.31.1'

CC [M] /mnt/sda1/trunk/build_dir/linux-x86_generic/xtables-addons-1.17/extensions/xt_DELUDE.o

/mnt/sda1/trunk/build_dir/linux-x86_generic/xtables-addons-1.17/extensions/xt_DELUDE.c: In function 'delude_send_reset':
/mnt/sda1/trunk/build_dir/linux-x86_generic/xtables-addons-1.17/extensions/xt_DELUDE.c:122: error: 'struct sk_buff' has no member named 'dst'
/mnt/sda1/trunk/build_dir/linux-x86_generic/xtables-addons-1.17/extensions/xt_DELUDE.c:123: error: 'struct sk_buff' has no member named 'dst'
/mnt/sda1/trunk/build_dir/linux-x86_generic/xtables-addons-1.17/extensions/xt_DELUDE.c:123: error: 'struct sk_buff' has no member named 'dst'
/mnt/sda1/trunk/build_dir/linux-x86_generic/xtables-addons-1.17/extensions/xt_DELUDE.c:130: error: 'struct sk_buff' has no member named 'dst'
/mnt/sda1/trunk/build_dir/linux-x86_generic/xtables-addons-1.17/extensions/xt_DELUDE.c:134: error: 'struct sk_buff' has no member named 'dst'
make[8]: * /mnt/sda1/trunk/build_dir/linux-x86_generic/xtables-addons-1.17/extensions/xt_DELUDE.o Error 1
make[7]:
* [_module_/mnt/sda1/trunk/build_dir/linux-x86_generic/xtables-addons-1.17/extensions] Error 2
make[7]: Leaving directory `/mnt/sda1/trunk/build_dir/linux-x86_generic/linux-2.6.31.1'
make[6]: * [modules] Error 2
make[6]: Leaving directory `/mnt/sda1/trunk/build_dir/linux-x86_generic/xtables-addons-1.17/extensions'
make[5]:
* [all-recursive] Error 1
make[5]: Leaving directory `/mnt/sda1/trunk/build_dir/linux-x86_generic/xtables-addons-1.17'
make[4]: * [all] Error 2
make[4]: Leaving directory `/mnt/sda1/trunk/build_dir/linux-x86_generic/xtables-addons-1.17'
make[3]:
* /mnt/sda1/trunk/build_dir/linux-x86_generic/xtables-addons-1.17/.built Error 2
make[3]: Leaving directory `/mnt/sda1/trunk/feeds/packages/net/xtables-addons'
make[2]: * [package/feeds/packages/xtables-addons/compile] Error 2
make[2]: Leaving directory `/mnt/sda1/trunk'
make[1]:
* /mnt/sda1/trunk/staging_dir/target-i386_uClibc-0.9.30.1/stamp/.package_compile Error 2
make[1]: Leaving directory `/mnt/sda1/trunk'
make: * [world] Error 2

Attachments (1)

xtables-addons_5940.diff (1.3 KB) - added by anonymous 8 years ago.
2.6.31 support was added in 1.18

Download all attachments as: .zip

Change History (3)

Changed 8 years ago by anonymous

2.6.31 support was added in 1.18

comment:1 Changed 8 years ago by nbd

  • Resolution set to fixed
  • Status changed from new to closed

added in r17895, thanks

comment:2 Changed 4 years ago by jow

  • Milestone changed from Attitude Adjustment 12.09 to Barrier Breaker 14.07

Milestone Attitude Adjustment 12.09 deleted

Add Comment

Modify Ticket

Action
as closed .
The resolution will be deleted. Next status will be 'reopened'.
Author


E-mail address and user name can be saved in the Preferences.

 
Note: See TracTickets for help on using tickets.