Modify

Opened 8 years ago

Closed 8 years ago

Last modified 4 years ago

#5686 closed enhancement (duplicate)

Python compilation on Mac OS X (10.5.8)

Reported by: ItHasU Owned by: developers
Priority: low Milestone: Barrier Breaker 14.07
Component: packages Version: Kamikaze 8.09
Keywords: python, mac os x Cc:

Description

I had issues with compiling the Python module under Mac OS X using:

  • Mac OS X Leopard (10.5.8)
  • GCC 4.0.1 (Apple Inc. build 5493)

I had to made some modifications to the Python package Makefile to make it work.

First I had to add : "--disable-universalsdk --disable-framework --disable-toolbox-glue" flags to both configure command line cause toolbox-glue didn't compiled (not sure it's really a major feature of python by the way).

Second I added the "-lm" flag to LDFLAGS cause libm was not automagically linked.

Although I made the modification on :
openwrt/branches/packages_8.09/lang/python/Makefile, I believe, they apply to the trunk version of the Makefile as well.

I think those modifications are purely Mac OS X specific, and I don't even know if the first flags apply to linux. Hope this would help anyone.

Attachments (0)

Change History (3)

comment:1 Changed 8 years ago by florian

  • Resolution set to duplicate
  • Status changed from new to closed

Duplicate of #6219.

comment:2 Changed 8 years ago by marca56@…

Au contraire, mon frere...

In file included from Python/mactoolboxglue.c:27:
Include/pymactoolbox.h:10:27: error: Carbon/Carbon.h: No such file or directory
Include/pymactoolbox.h:13:33: error: QuickTime/QuickTime.h: No such file or directory
In file included from Python/mactoolboxglue.c:27:
Include/pymactoolbox.h:23: warning: parameter names (without types) in function declaration
Include/pymactoolbox.h:25: error: expected '=', ',', ';', 'asm' or 'attribute' before 'PyMac_GetFullPathname'
Include/pymactoolbox.h:32: error: expected declaration specifiers or '...' before 'OSType'
Include/pymactoolbox.h:33: warning: parameter names (without types) in function declaration
Include/pymactoolbox.h:35: warning: parameter names (without types) in function declaration
Include/pymactoolbox.h:37: error: expected declaration specifiers or '...' before 'Str255'
Include/pymactoolbox.h:38: warning: parameter names (without types) in function declaration
Include/pymactoolbox.h:39: warning: parameter names (without types) in function declaration
Include/pymactoolbox.h:42: error: expected declaration specifiers or '...' before 'Rect'
Include/pymactoolbox.h:43: error: expected ')' before '*' token
Include/pymactoolbox.h:45: error: expected declaration specifiers or '...' before 'Point'
Include/pymactoolbox.h:46: warning: parameter names (without types) in function declaration
Include/pymactoolbox.h:48: error: expected declaration specifiers or '...' before 'EventRecord'
Include/pymactoolbox.h:50: error: expected ')' before '*' token
Include/pymactoolbox.h:53: error: expected declaration specifiers or '...' before 'Fixed'
Include/pymactoolbox.h:54: warning: parameter names (without types) in function declaration
Include/pymactoolbox.h:55: error: expected declaration specifiers or '...' before 'wide'
Include/pymactoolbox.h:56: error: expected ')' before '*' token
Include/pymactoolbox.h:93: error: expected declaration specifiers or '...' before 'FSSpec'
Include/pymactoolbox.h:94: error: expected ')' before '*' token
Include/pymactoolbox.h:97: error: expected declaration specifiers or '...' before 'FSRef'
Include/pymactoolbox.h:98: error: expected ')' before '*' token
Include/pymactoolbox.h:101: error: expected ')' before '*' token
Include/pymactoolbox.h:102: error: expected ')' before '*' token
Include/pymactoolbox.h:103: error: expected declaration specifiers or '...' before 'AppleEvent'
Include/pymactoolbox.h:106: warning: parameter names (without types) in function declaration
Include/pymactoolbox.h:107: error: expected declaration specifiers or '...' before 'Component'
Include/pymactoolbox.h:108: warning: parameter names (without types) in function declaration
Include/pymactoolbox.h:109: error: expected declaration specifiers or '...' before 'ComponentInstance'
Include/pymactoolbox.h:113: warning: parameter names (without types) in function declaration
Include/pymactoolbox.h:114: error: expected declaration specifiers or '...' before 'ControlHandle'
Include/pymactoolbox.h:119: warning: parameter names (without types) in function declaration
Include/pymactoolbox.h:120: error: expected declaration specifiers or '...' before 'DialogPtr'
Include/pymactoolbox.h:121: warning: parameter names (without types) in function declaration
Include/pymactoolbox.h:126: warning: parameter names (without types) in function declaration
Include/pymactoolbox.h:127: error: expected declaration specifiers or '...' before 'DragReference'
Include/pymactoolbox.h:132: warning: parameter names (without types) in function declaration
Include/pymactoolbox.h:133: error: expected declaration specifiers or '...' before 'ListHandle'
Include/pymactoolbox.h:138: warning: parameter names (without types) in function declaration
Include/pymactoolbox.h:139: error: expected declaration specifiers or '...' before 'MenuHandle'
Include/pymactoolbox.h:144: warning: parameter names (without types) in function declaration
Include/pymactoolbox.h:145: error: expected declaration specifiers or '...' before 'GrafPtr'
Include/pymactoolbox.h:146: warning: parameter names (without types) in function declaration
Include/pymactoolbox.h:147: error: expected declaration specifiers or '...' before 'BitMapPtr'
Include/pymactoolbox.h:148: error: expected ')' before '*' token
Include/pymactoolbox.h:149: error: expected declaration specifiers or '...' before 'RGBColor'
Include/pymactoolbox.h:154: warning: parameter names (without types) in function declaration
Include/pymactoolbox.h:155: error: expected declaration specifiers or '...' before 'GWorldPtr'
Include/pymactoolbox.h:160: warning: parameter names (without types) in function declaration
Include/pymactoolbox.h:161: error: expected declaration specifiers or '...' before 'Track'
Include/pymactoolbox.h:162: warning: parameter names (without types) in function declaration
Include/pymactoolbox.h:163: error: expected declaration specifiers or '...' before 'Movie'
Include/pymactoolbox.h:164: warning: parameter names (without types) in function declaration
Include/pymactoolbox.h:165: error: expected declaration specifiers or '...' before 'MovieController'
Include/pymactoolbox.h:166: warning: parameter names (without types) in function declaration
Include/pymactoolbox.h:167: error: expected declaration specifiers or '...' before 'TimeBase'
Include/pymactoolbox.h:168: warning: parameter names (without types) in function declaration
Include/pymactoolbox.h:169: error: expected declaration specifiers or '...' before 'UserData'
Include/pymactoolbox.h:170: warning: parameter names (without types) in function declaration
Include/pymactoolbox.h:171: error: expected declaration specifiers or '...' before 'Media'
Include/pymactoolbox.h:175: warning: parameter names (without types) in function declaration
Include/pymactoolbox.h:176: error: expected declaration specifiers or '...' before 'Handle'
Include/pymactoolbox.h:177: warning: parameter names (without types) in function declaration
Include/pymactoolbox.h:178: error: expected declaration specifiers or '...' before 'Handle'
Include/pymactoolbox.h:182: warning: parameter names (without types) in function declaration
Include/pymactoolbox.h:183: error: expected declaration specifiers or '...' before 'TEHandle'
Include/pymactoolbox.h:188: warning: parameter names (without types) in function declaration
Include/pymactoolbox.h:189: error: expected declaration specifiers or '...' before 'WindowPtr'
Include/pymactoolbox.h:190: warning: parameter names (without types) in function declaration
Include/pymactoolbox.h:194: warning: parameter names (without types) in function declaration
Include/pymactoolbox.h:195: error: expected declaration specifiers or '...' before 'CFTypeRef'
Include/pymactoolbox.h:196: warning: parameter names (without types) in function declaration
Include/pymactoolbox.h:197: error: expected declaration specifiers or '...' before 'CFTypeRef'
Include/pymactoolbox.h:198: warning: parameter names (without types) in function declaration
Include/pymactoolbox.h:199: error: expected declaration specifiers or '...' before 'CFStringRef'
Include/pymactoolbox.h:200: warning: parameter names (without types) in function declaration
Include/pymactoolbox.h:201: error: expected declaration specifiers or '...' before 'CFMutableStringRef'
Include/pymactoolbox.h:202: warning: parameter names (without types) in function declaration
Include/pymactoolbox.h:203: error: expected declaration specifiers or '...' before 'CFArrayRef'
Include/pymactoolbox.h:204: warning: parameter names (without types) in function declaration
Include/pymactoolbox.h:205: error: expected declaration specifiers or '...' before 'CFMutableArrayRef'
Include/pymactoolbox.h:206: warning: parameter names (without types) in function declaration
Include/pymactoolbox.h:207: error: expected declaration specifiers or '...' before 'CFDictionaryRef'
Include/pymactoolbox.h:208: warning: parameter names (without types) in function declaration
Include/pymactoolbox.h:209: error: expected declaration specifiers or '...' before 'CFMutableDictionaryRef'
Include/pymactoolbox.h:210: warning: parameter names (without types) in function declaration
Include/pymactoolbox.h:211: error: expected declaration specifiers or '...' before 'CFURLRef'
Include/pymactoolbox.h:212: error: expected declaration specifiers or '...' before 'CFURLRef'
Python/mactoolboxglue.c:103: error: expected ')' before 'err'
Python/mactoolboxglue.c:111: error: expected '=', ',', ';', 'asm' or 'attribute' before 'PyMac_GetFullPathname'
Python/mactoolboxglue.c:161: error: expected declaration specifiers or '...' before 'OSType'
Python/mactoolboxglue.c: In function 'PyMac_GetOSType':
Python/mactoolboxglue.c:170: error: 'pr' undeclared (first use in this function)
Python/mactoolboxglue.c:170: error: (Each undeclared identifier is reported only once
Python/mactoolboxglue.c:170: error: for each function it appears in.)
Python/mactoolboxglue.c:170: error: 'OSType' undeclared (first use in this function)
Python/mactoolboxglue.c: At top level:
Python/mactoolboxglue.c:176: error: expected ')' before 't'
Python/mactoolboxglue.c:184: error: expected ')' before 't'
Python/mactoolboxglue.c:192: error: expected declaration specifiers or '...' before 'Str255'
Python/mactoolboxglue.c: In function 'PyMac_GetStr255':
Python/mactoolboxglue.c:200: error: 'pbuf' undeclared (first use in this function)
Python/mactoolboxglue.c: At top level:
Python/mactoolboxglue.c:207: error: expected ')' before 's'
Python/mactoolboxglue.c:217: error: expected ')' before 's'
Python/mactoolboxglue.c:233: error: expected declaration specifiers or '...' before 'Rect'
Python/mactoolboxglue.c: In function 'PyMac_GetRect':
Python/mactoolboxglue.c:235: error: 'r' undeclared (first use in this function)
Python/mactoolboxglue.c: At top level:
Python/mactoolboxglue.c:240: error: expected ')' before '*' token
Python/mactoolboxglue.c:251: error: expected declaration specifiers or '...' before 'Point'
Python/mactoolboxglue.c: In function 'PyMac_GetPoint':
Python/mactoolboxglue.c:253: error: 'p' undeclared (first use in this function)
Python/mactoolboxglue.c: At top level:
Python/mactoolboxglue.c:258: error: expected ')' before 'p'
Python/mactoolboxglue.c:267: error: expected declaration specifiers or '...' before 'EventRecord'
Python/mactoolboxglue.c: In function 'PyMac_GetEventRecord':
Python/mactoolboxglue.c:270: error: 'e' undeclared (first use in this function)
Python/mactoolboxglue.c: At top level:
Python/mactoolboxglue.c:280: error: expected ')' before '*' token
Python/mactoolboxglue.c:293: error: expected declaration specifiers or '...' before 'Fixed'
Python/mactoolboxglue.c: In function 'PyMac_GetFixed':
Python/mactoolboxglue.c:299: error: 'f' undeclared (first use in this function)
Python/mactoolboxglue.c:299: error: 'Fixed' undeclared (first use in this function)
Python/mactoolboxglue.c: At top level:
Python/mactoolboxglue.c:305: error: expected ')' before 'f'
Python/mactoolboxglue.c:316: error: expected declaration specifiers or '...' before 'wide'
Python/mactoolboxglue.c: In function 'PyMac_Getwide':
Python/mactoolboxglue.c:319: error: 'rv' undeclared (first use in this function)
Python/mactoolboxglue.c: At top level:
Python/mactoolboxglue.c:330: error: expected ')' before '*' token
Python/mactoolboxglue.c:382: error: expected ')' before '*' token
Python/mactoolboxglue.c:382: error: expected ')' before '*' token
Python/mactoolboxglue.c:383: error: expected declaration specifiers or '...' before 'FSSpec'
Python/mactoolboxglue.c:383: error: expected declaration specifiers or '...' before 'FSSpec'
Python/mactoolboxglue.c: In function 'PyMac_GetFSSpec':
Python/mactoolboxglue.c:383: error: 'cobj' undeclared (first use in this function)
Python/mactoolboxglue.c:383: error: too many arguments to function 'PyMacGluePtr_PyMac_GetFSSpec'
Python/mactoolboxglue.c: At top level:
Python/mactoolboxglue.c:384: error: expected ')' before '*' token
Python/mactoolboxglue.c:384: error: expected ')' before '*' token
Python/mactoolboxglue.c:385: error: expected declaration specifiers or '...' before 'FSRef'
Python/mactoolboxglue.c:385: error: expected declaration specifiers or '...' before 'FSRef'
Python/mactoolboxglue.c: In function 'PyMac_GetFSRef':
Python/mactoolboxglue.c:385: error: 'cobj' undeclared (first use in this function)
Python/mactoolboxglue.c:385: error: too many arguments to function 'PyMacGluePtr_PyMac_GetFSRef'
Python/mactoolboxglue.c: At top level:
Python/mactoolboxglue.c:387: error: expected ')' before '*' token
Python/mactoolboxglue.c:387: error: expected ')' before '*' token
Python/mactoolboxglue.c:388: error: expected ')' before '*' token
Python/mactoolboxglue.c:388: error: expected ')' before '*' token
Python/mactoolboxglue.c:389: error: expected declaration specifiers or '...' before 'AppleEvent'
Python/mactoolboxglue.c:389: error: expected declaration specifiers or '...' before 'AppleEvent'
Python/mactoolboxglue.c: In function 'AEDesc_Convert':
Python/mactoolboxglue.c:389: error: 'cobj' undeclared (first use in this function)
Python/mactoolboxglue.c:389: error: too many arguments to function 'PyMacGluePtr_AEDesc_Convert'
Python/mactoolboxglue.c: At top level:
Python/mactoolboxglue.c:391: warning: parameter names (without types) in function declaration
Python/mactoolboxglue.c:391: error: expected ')' before 'cobj'
Python/mactoolboxglue.c:392: error: expected declaration specifiers or '...' before 'Component'
Python/mactoolboxglue.c:392: error: expected declaration specifiers or '...' before 'Component'
Python/mactoolboxglue.c: In function 'CmpObj_Convert':
Python/mactoolboxglue.c:392: error: 'cobj' undeclared (first use in this function)
Python/mactoolboxglue.c:392: error: too many arguments to function 'PyMacGluePtr_CmpObj_Convert'
Python/mactoolboxglue.c: At top level:
Python/mactoolboxglue.c:393: warning: parameter names (without types) in function declaration
Python/mactoolboxglue.c:393: error: expected ')' before 'cobj'
Python/mactoolboxglue.c:394: error: expected declaration specifiers or '...' before 'ComponentInstance'
Python/mactoolboxglue.c:394: error: expected declaration specifiers or '...' before 'ComponentInstance'
Python/mactoolboxglue.c: In function 'CmpInstObj_Convert':
Python/mactoolboxglue.c:394: error: 'cobj' undeclared (first use in this function)
Python/mactoolboxglue.c:394: error: too many arguments to function 'PyMacGluePtr_CmpInstObj_Convert'
Python/mactoolboxglue.c: At top level:
Python/mactoolboxglue.c:396: warning: parameter names (without types) in function declaration
Python/mactoolboxglue.c:396: error: expected ')' before 'cobj'
Python/mactoolboxglue.c:397: error: expected declaration specifiers or '...' before 'ControlHandle'
Python/mactoolboxglue.c:397: error: expected declaration specifiers or '...' before 'ControlHandle'
Python/mactoolboxglue.c: In function 'CtlObj_Convert':
Python/mactoolboxglue.c:397: error: 'cobj' undeclared (first use in this function)
Python/mactoolboxglue.c:397: error: too many arguments to function 'PyMacGluePtr_CtlObj_Convert'
Python/mactoolboxglue.c: At top level:
Python/mactoolboxglue.c:399: warning: parameter names (without types) in function declaration
Python/mactoolboxglue.c:399: error: expected ')' before 'cobj'
Python/mactoolboxglue.c:400: error: expected declaration specifiers or '...' before 'DialogPtr'
Python/mactoolboxglue.c:400: error: expected declaration specifiers or '...' before 'DialogPtr'
Python/mactoolboxglue.c: In function 'DlgObj_Convert':
Python/mactoolboxglue.c:400: error: 'cobj' undeclared (first use in this function)
Python/mactoolboxglue.c:400: error: too many arguments to function 'PyMacGluePtr_DlgObj_Convert'
Python/mactoolboxglue.c: At top level:
Python/mactoolboxglue.c:401: warning: parameter names (without types) in function declaration
Python/mactoolboxglue.c:401: error: expected ')' before 'cobj'
Python/mactoolboxglue.c:403: warning: parameter names (without types) in function declaration
Python/mactoolboxglue.c:403: error: expected ')' before 'cobj'
Python/mactoolboxglue.c:404: error: expected declaration specifiers or '...' before 'DragReference'
Python/mactoolboxglue.c:404: error: expected declaration specifiers or '...' before 'DragReference'
Python/mactoolboxglue.c: In function 'DragObj_Convert':
Python/mactoolboxglue.c:404: error: 'cobj' undeclared (first use in this function)
Python/mactoolboxglue.c:404: error: too many arguments to function 'PyMacGluePtr_DragObj_Convert'
Python/mactoolboxglue.c: At top level:
Python/mactoolboxglue.c:406: warning: parameter names (without types) in function declaration
Python/mactoolboxglue.c:406: error: expected ')' before 'cobj'
Python/mactoolboxglue.c:407: error: expected declaration specifiers or '...' before 'ListHandle'
Python/mactoolboxglue.c:407: error: expected declaration specifiers or '...' before 'ListHandle'
Python/mactoolboxglue.c: In function 'ListObj_Convert':
Python/mactoolboxglue.c:407: error: 'cobj' undeclared (first use in this function)
Python/mactoolboxglue.c:407: error: too many arguments to function 'PyMacGluePtr_ListObj_Convert'
Python/mactoolboxglue.c: At top level:
Python/mactoolboxglue.c:409: warning: parameter names (without types) in function declaration
Python/mactoolboxglue.c:409: error: expected ')' before 'cobj'
Python/mactoolboxglue.c:410: error: expected declaration specifiers or '...' before 'MenuHandle'
Python/mactoolboxglue.c:410: error: expected declaration specifiers or '...' before 'MenuHandle'
Python/mactoolboxglue.c: In function 'MenuObj_Convert':
Python/mactoolboxglue.c:410: error: 'cobj' undeclared (first use in this function)
Python/mactoolboxglue.c:410: error: too many arguments to function 'PyMacGluePtr_MenuObj_Convert'
Python/mactoolboxglue.c: At top level:
Python/mactoolboxglue.c:412: warning: parameter names (without types) in function declaration
Python/mactoolboxglue.c:412: error: expected ')' before 'cobj'
Python/mactoolboxglue.c:413: error: expected declaration specifiers or '...' before 'GrafPtr'
Python/mactoolboxglue.c:413: error: expected declaration specifiers or '...' before 'GrafPtr'
Python/mactoolboxglue.c: In function 'GrafObj_Convert':
Python/mactoolboxglue.c:413: error: 'cobj' undeclared (first use in this function)
Python/mactoolboxglue.c:413: error: too many arguments to function 'PyMacGluePtr_GrafObj_Convert'
Python/mactoolboxglue.c: At top level:
Python/mactoolboxglue.c:414: warning: parameter names (without types) in function declaration
Python/mactoolboxglue.c:414: error: expected ')' before 'cobj'
Python/mactoolboxglue.c:415: error: expected declaration specifiers or '...' before 'BitMapPtr'
Python/mactoolboxglue.c:415: error: expected declaration specifiers or '...' before 'BitMapPtr'
Python/mactoolboxglue.c: In function 'BMObj_Convert':
Python/mactoolboxglue.c:415: error: 'cobj' undeclared (first use in this function)
Python/mactoolboxglue.c:415: error: too many arguments to function 'PyMacGluePtr_BMObj_Convert'
Python/mactoolboxglue.c: At top level:
Python/mactoolboxglue.c:416: error: expected ')' before '*' token
Python/mactoolboxglue.c:416: error: expected ')' before '*' token
Python/mactoolboxglue.c:417: error: expected declaration specifiers or '...' before 'RGBColor'
Python/mactoolboxglue.c:417: error: expected declaration specifiers or '...' before 'RGBColor'
Python/mactoolboxglue.c: In function 'QdRGB_Convert':
Python/mactoolboxglue.c:417: error: 'cobj' undeclared (first use in this function)
Python/mactoolboxglue.c:417: error: too many arguments to function 'PyMacGluePtr_QdRGB_Convert'
Python/mactoolboxglue.c: At top level:
Python/mactoolboxglue.c:419: warning: parameter names (without types) in function declaration
Python/mactoolboxglue.c:419: error: expected ')' before 'cobj'
Python/mactoolboxglue.c:420: error: expected declaration specifiers or '...' before 'GWorldPtr'
Python/mactoolboxglue.c:420: error: expected declaration specifiers or '...' before 'GWorldPtr'
Python/mactoolboxglue.c: In function 'GWorldObj_Convert':
Python/mactoolboxglue.c:420: error: 'cobj' undeclared (first use in this function)
Python/mactoolboxglue.c:420: error: too many arguments to function 'PyMacGluePtr_GWorldObj_Convert'
Python/mactoolboxglue.c: At top level:
Python/mactoolboxglue.c:423: warning: parameter names (without types) in function declaration
Python/mactoolboxglue.c:423: error: expected ')' before 'cobj'
Python/mactoolboxglue.c:424: error: expected declaration specifiers or '...' before 'Track'
Python/mactoolboxglue.c:424: error: expected declaration specifiers or '...' before 'Track'
Python/mactoolboxglue.c: In function 'TrackObj_Convert':
Python/mactoolboxglue.c:424: error: 'cobj' undeclared (first use in this function)
Python/mactoolboxglue.c:424: error: too many arguments to function 'PyMacGluePtr_TrackObj_Convert'
Python/mactoolboxglue.c: At top level:
Python/mactoolboxglue.c:425: warning: parameter names (without types) in function declaration
Python/mactoolboxglue.c:425: error: expected ')' before 'cobj'
Python/mactoolboxglue.c:426: error: expected declaration specifiers or '...' before 'Movie'
Python/mactoolboxglue.c:426: error: expected declaration specifiers or '...' before 'Movie'
Python/mactoolboxglue.c: In function 'MovieObj_Convert':
Python/mactoolboxglue.c:426: error: 'cobj' undeclared (first use in this function)
Python/mactoolboxglue.c:426: error: too many arguments to function 'PyMacGluePtr_MovieObj_Convert'
Python/mactoolboxglue.c: At top level:
Python/mactoolboxglue.c:427: warning: parameter names (without types) in function declaration
Python/mactoolboxglue.c:427: error: expected ')' before 'cobj'
Python/mactoolboxglue.c:428: error: expected declaration specifiers or '...' before 'MovieController'
Python/mactoolboxglue.c:428: error: expected declaration specifiers or '...' before 'MovieController'
Python/mactoolboxglue.c: In function 'MovieCtlObj_Convert':
Python/mactoolboxglue.c:428: error: 'cobj' undeclared (first use in this function)
Python/mactoolboxglue.c:428: error: too many arguments to function 'PyMacGluePtr_MovieCtlObj_Convert'
Python/mactoolboxglue.c: At top level:
Python/mactoolboxglue.c:429: warning: parameter names (without types) in function declaration
Python/mactoolboxglue.c:429: error: expected ')' before 'cobj'
Python/mactoolboxglue.c:430: error: expected declaration specifiers or '...' before 'TimeBase'
Python/mactoolboxglue.c:430: error: expected declaration specifiers or '...' before 'TimeBase'
Python/mactoolboxglue.c: In function 'TimeBaseObj_Convert':
Python/mactoolboxglue.c:430: error: 'cobj' undeclared (first use in this function)
Python/mactoolboxglue.c:430: error: too many arguments to function 'PyMacGluePtr_TimeBaseObj_Convert'
Python/mactoolboxglue.c: At top level:
Python/mactoolboxglue.c:431: warning: parameter names (without types) in function declaration
Python/mactoolboxglue.c:431: error: expected ')' before 'cobj'
Python/mactoolboxglue.c:432: error: expected declaration specifiers or '...' before 'UserData'
Python/mactoolboxglue.c:432: error: expected declaration specifiers or '...' before 'UserData'
Python/mactoolboxglue.c: In function 'UserDataObj_Convert':
Python/mactoolboxglue.c:432: error: 'cobj' undeclared (first use in this function)
Python/mactoolboxglue.c:432: error: too many arguments to function 'PyMacGluePtr_UserDataObj_Convert'
Python/mactoolboxglue.c: At top level:
Python/mactoolboxglue.c:433: warning: parameter names (without types) in function declaration
Python/mactoolboxglue.c:433: error: expected ')' before 'cobj'
Python/mactoolboxglue.c:434: error: expected declaration specifiers or '...' before 'Media'
Python/mactoolboxglue.c:434: error: expected declaration specifiers or '...' before 'Media'
Python/mactoolboxglue.c: In function 'MediaObj_Convert':
Python/mactoolboxglue.c:434: error: 'cobj' undeclared (first use in this function)
Python/mactoolboxglue.c:434: error: too many arguments to function 'PyMacGluePtr_MediaObj_Convert'
Python/mactoolboxglue.c: At top level:
Python/mactoolboxglue.c:437: warning: parameter names (without types) in function declaration
Python/mactoolboxglue.c:437: error: expected ')' before 'cobj'
Python/mactoolboxglue.c:438: error: expected declaration specifiers or '...' before 'Handle'
Python/mactoolboxglue.c:438: error: expected declaration specifiers or '...' before 'Handle'
Python/mactoolboxglue.c: In function 'ResObj_Convert':
Python/mactoolboxglue.c:438: error: 'cobj' undeclared (first use in this function)
Python/mactoolboxglue.c:438: error: too many arguments to function 'PyMacGluePtr_ResObj_Convert'
Python/mactoolboxglue.c: At top level:
Python/mactoolboxglue.c:439: warning: parameter names (without types) in function declaration
Python/mactoolboxglue.c:439: error: expected ')' before 'cobj'
Python/mactoolboxglue.c:440: error: expected declaration specifiers or '...' before 'Handle'
Python/mactoolboxglue.c:440: error: expected declaration specifiers or '...' before 'Handle'
Python/mactoolboxglue.c: In function 'OptResObj_Convert':
Python/mactoolboxglue.c:440: error: 'cobj' undeclared (first use in this function)
Python/mactoolboxglue.c:440: error: too many arguments to function 'PyMacGluePtr_OptResObj_Convert'
Python/mactoolboxglue.c: At top level:
Python/mactoolboxglue.c:442: warning: parameter names (without types) in function declaration
Python/mactoolboxglue.c:442: error: expected ')' before 'cobj'
Python/mactoolboxglue.c:443: error: expected declaration specifiers or '...' before 'TEHandle'
Python/mactoolboxglue.c:443: error: expected declaration specifiers or '...' before 'TEHandle'
Python/mactoolboxglue.c: In function 'TEObj_Convert':
Python/mactoolboxglue.c:443: error: 'cobj' undeclared (first use in this function)
Python/mactoolboxglue.c:443: error: too many arguments to function 'PyMacGluePtr_TEObj_Convert'
Python/mactoolboxglue.c: At top level:
Python/mactoolboxglue.c:445: warning: parameter names (without types) in function declaration
Python/mactoolboxglue.c:445: error: expected ')' before 'cobj'
Python/mactoolboxglue.c:446: error: expected declaration specifiers or '...' before 'WindowPtr'
Python/mactoolboxglue.c:446: error: expected declaration specifiers or '...' before 'WindowPtr'
Python/mactoolboxglue.c: In function 'WinObj_Convert':
Python/mactoolboxglue.c:446: error: 'cobj' undeclared (first use in this function)
Python/mactoolboxglue.c:446: error: too many arguments to function 'PyMacGluePtr_WinObj_Convert'
Python/mactoolboxglue.c: At top level:
Python/mactoolboxglue.c:447: warning: parameter names (without types) in function declaration
Python/mactoolboxglue.c:447: error: expected ')' before 'cobj'
Python/mactoolboxglue.c:449: error: expected declaration specifiers or '...' before 'CFTypeRef'
Python/mactoolboxglue.c:449: error: expected declaration specifiers or '...' before 'CFTypeRef'
Python/mactoolboxglue.c: In function 'CFObj_Convert':
Python/mactoolboxglue.c:449: error: 'cobj' undeclared (first use in this function)
Python/mactoolboxglue.c:449: error: too many arguments to function 'PyMacGluePtr_CFObj_Convert'
Python/mactoolboxglue.c: At top level:
Python/mactoolboxglue.c:450: warning: parameter names (without types) in function declaration
Python/mactoolboxglue.c:450: error: expected ')' before 'cobj'
Python/mactoolboxglue.c:452: error: expected declaration specifiers or '...' before 'CFTypeRef'
Python/mactoolboxglue.c:452: error: expected declaration specifiers or '...' before 'CFTypeRef'
Python/mactoolboxglue.c: In function 'CFTypeRefObj_Convert':
Python/mactoolboxglue.c:452: error: 'cobj' undeclared (first use in this function)
Python/mactoolboxglue.c:452: error: too many arguments to function 'PyMacGluePtr_CFTypeRefObj_Convert'
Python/mactoolboxglue.c: At top level:
Python/mactoolboxglue.c:453: warning: parameter names (without types) in function declaration
Python/mactoolboxglue.c:453: error: expected ')' before 'cobj'
Python/mactoolboxglue.c:455: error: expected declaration specifiers or '...' before 'CFStringRef'
Python/mactoolboxglue.c:455: error: expected declaration specifiers or '...' before 'CFStringRef'
Python/mactoolboxglue.c: In function 'CFStringRefObj_Convert':
Python/mactoolboxglue.c:455: error: 'cobj' undeclared (first use in this function)
Python/mactoolboxglue.c:455: error: too many arguments to function 'PyMacGluePtr_CFStringRefObj_Convert'
Python/mactoolboxglue.c: At top level:
Python/mactoolboxglue.c:456: warning: parameter names (without types) in function declaration
Python/mactoolboxglue.c:456: error: expected ')' before 'cobj'
Python/mactoolboxglue.c:457: error: expected declaration specifiers or '...' before 'CFMutableStringRef'
Python/mactoolboxglue.c:457: error: expected declaration specifiers or '...' before 'CFMutableStringRef'
Python/mactoolboxglue.c: In function 'CFMutableStringRefObj_Convert':
Python/mactoolboxglue.c:457: error: 'cobj' undeclared (first use in this function)
Python/mactoolboxglue.c:457: error: too many arguments to function 'PyMacGluePtr_CFMutableStringRefObj_Convert'
Python/mactoolboxglue.c: At top level:
Python/mactoolboxglue.c:458: warning: parameter names (without types) in function declaration
Python/mactoolboxglue.c:458: error: expected ')' before 'cobj'
Python/mactoolboxglue.c:460: error: expected declaration specifiers or '...' before 'CFArrayRef'
Python/mactoolboxglue.c:460: error: expected declaration specifiers or '...' before 'CFArrayRef'
Python/mactoolboxglue.c: In function 'CFArrayRefObj_Convert':
Python/mactoolboxglue.c:460: error: 'cobj' undeclared (first use in this function)
Python/mactoolboxglue.c:460: error: too many arguments to function 'PyMacGluePtr_CFArrayRefObj_Convert'
Python/mactoolboxglue.c: At top level:
Python/mactoolboxglue.c:461: warning: parameter names (without types) in function declaration
Python/mactoolboxglue.c:461: error: expected ')' before 'cobj'
Python/mactoolboxglue.c:462: error: expected declaration specifiers or '...' before 'CFMutableArrayRef'
Python/mactoolboxglue.c:462: error: expected declaration specifiers or '...' before 'CFMutableArrayRef'
Python/mactoolboxglue.c: In function 'CFMutableArrayRefObj_Convert':
Python/mactoolboxglue.c:462: error: 'cobj' undeclared (first use in this function)
Python/mactoolboxglue.c:462: error: too many arguments to function 'PyMacGluePtr_CFMutableArrayRefObj_Convert'
Python/mactoolboxglue.c: At top level:
Python/mactoolboxglue.c:463: warning: parameter names (without types) in function declaration
Python/mactoolboxglue.c:463: error: expected ')' before 'cobj'
Python/mactoolboxglue.c:465: error: expected declaration specifiers or '...' before 'CFDictionaryRef'
Python/mactoolboxglue.c:465: error: expected declaration specifiers or '...' before 'CFDictionaryRef'
Python/mactoolboxglue.c: In function 'CFDictionaryRefObj_Convert':
Python/mactoolboxglue.c:465: error: 'cobj' undeclared (first use in this function)
Python/mactoolboxglue.c:465: error: too many arguments to function 'PyMacGluePtr_CFDictionaryRefObj_Convert'
Python/mactoolboxglue.c: At top level:
Python/mactoolboxglue.c:466: warning: parameter names (without types) in function declaration
Python/mactoolboxglue.c:466: error: expected ')' before 'cobj'
Python/mactoolboxglue.c:467: error: expected declaration specifiers or '...' before 'CFMutableDictionaryRef'
Python/mactoolboxglue.c:467: error: expected declaration specifiers or '...' before 'CFMutableDictionaryRef'
Python/mactoolboxglue.c: In function 'CFMutableDictionaryRefObj_Convert':
Python/mactoolboxglue.c:467: error: 'cobj' undeclared (first use in this function)
Python/mactoolboxglue.c:467: error: too many arguments to function 'PyMacGluePtr_CFMutableDictionaryRefObj_Convert'
Python/mactoolboxglue.c: At top level:
Python/mactoolboxglue.c:468: warning: parameter names (without types) in function declaration
Python/mactoolboxglue.c:468: error: expected ')' before 'cobj'
Python/mactoolboxglue.c:470: error: expected declaration specifiers or '...' before 'CFURLRef'
Python/mactoolboxglue.c:470: error: expected declaration specifiers or '...' before 'CFURLRef'
Python/mactoolboxglue.c: In function 'CFURLRefObj_Convert':
Python/mactoolboxglue.c:470: error: 'cobj' undeclared (first use in this function)
Python/mactoolboxglue.c:470: error: too many arguments to function 'PyMacGluePtr_CFURLRefObj_Convert'
Python/mactoolboxglue.c: At top level:
Python/mactoolboxglue.c:471: error: expected declaration specifiers or '...' before 'CFURLRef'
Python/mactoolboxglue.c:471: error: expected declaration specifiers or '...' before 'CFURLRef'
Python/mactoolboxglue.c: In function 'OptionalCFURLRefObj_Convert':
Python/mactoolboxglue.c:471: error: 'cobj' undeclared (first use in this function)
Python/mactoolboxglue.c:471: error: too many arguments to function 'PyMacGluePtr_OptionalCFURLRefObj_Convert'
Python/mactoolboxglue.c: At top level:
Python/mactoolboxglue.c:472: warning: parameter names (without types) in function declaration
Python/mactoolboxglue.c:472: error: expected ')' before 'cobj'
make[4]: * [Python/mactoolboxglue.o] Error 1
make[3]:
* /Users/marca56/openwrt/build_dir/target-mips_uClibc-0.9.30.1/Python-2.6.4/.built Error 2
make[2]: * [package/feeds/packages/python/compile] Error 2
make[1]:
* /Users/marca56/openwrt/staging_dir/target-mips_uClibc-0.9.30.1/stamp/.package_compile Error 2
make: * [world] Error 2

marc.

comment:3 Changed 4 years ago by jow

  • Milestone changed from Attitude Adjustment 12.09 to Barrier Breaker 14.07

Milestone Attitude Adjustment 12.09 deleted

Add Comment

Modify Ticket

Action
as closed .
The resolution will be deleted. Next status will be 'reopened'.
Author


E-mail address and user name can be saved in the Preferences.

 
Note: See TracTickets for help on using tickets.