Modify

Opened 9 years ago

Closed 9 years ago

#4944 closed defect (invalid)

compile errer .... T.T

Reported by: sazajins@… Owned by: developers
Priority: high Milestone: Kamikaze 8.09.1
Component: packages Version: Kamikaze 8.09
Keywords: IPv6 Cc:

Description (last modified by nico)

what is problem this...


scripts/kconfig/conf -s arch/arm/Kconfig
CHK include/linux/version.h
UPD include/linux/version.h
SYMLINK include/asm-arm/arch -> include/asm-arm/arch-ksz8695
Generating include/asm-arm/mach-types.h
CHK include/linux/utsrelease.h
UPD include/linux/utsrelease.h
SYMLINK include/asm -> include/asm-arm
CC arch/arm/kernel/asm-offsets.s
GEN include/asm-arm/asm-offsets.h
CALL scripts/checksyscalls.sh
<stdin>:1097:2: warning: #warning syscall fadvise64 not implemented
<stdin>:1265:2: warning: #warning syscall migrate_pages not implemented
<stdin>:1321:2: warning: #warning syscall pselect6 not implemented
<stdin>:1325:2: warning: #warning syscall ppoll not implemented
<stdin>:1365:2: warning: #warning syscall epoll_pwait not implemented
<stdin>:1385:2: warning: #warning syscall fallocate not implemented
CC scripts/mod/empty.o
HOSTCC scripts/mod/mk_elfconfig
MKELF scripts/mod/elfconfig.h
HOSTCC scripts/mod/file2alias.o
HOSTCC scripts/mod/modpost.o
HOSTCC scripts/mod/sumversion.o
HOSTLD scripts/mod/modpost
HOSTCC scripts/bin2c
make[5]: Leaving directory `/opt/OpenWRT/kamikaze_8.09_rc1/build_dir/linux-micr el_centaur_ksz8695p/linux-2.6.23.17'
rm -rf /opt/OpenWRT/kamikaze_8.09_rc1/build_dir/linux-micrel_centaur_ksz8695p/m odules
touch /opt/OpenWRT/kamikaze_8.09_rc1/build_dir/linux-micrel_centaur_ksz8695p/li nux-2.6.23.17/.configured
rm -f /opt/OpenWRT/kamikaze_8.09_rc1/build_dir/linux-micrel_centaur_ksz8695p/li nux-2.6.23.17/vmlinux /opt/OpenWRT/kamikaze_8.09_rc1/build_dir/linux-micrel_centaur_ksz8695p/linux-2.6.23.17/System.map
make -C /opt/OpenWRT/kamikaze_8.09_rc1/build_dir/linux-micrel_centaur_ksz8695p/ lin"ux-2.6.23.17 CROSS_COMPILE=""arm-linux-uclibc-"" ARCH=""arm"" KBUILD_HAVE_NLS=no CONFIG_SHELL=""/bin/bash"" CC=""arm-linux-uclibc-gcc"" modules"
make[5]: Entering directory `/opt/OpenWRT/kamikaze_8.09_rc1/build_dir/linux-mic rel_centaur_ksz8695p/linux-2.6.23.17'
CHK include/linux/version.h
make[6]: `include/asm-arm/mach-types.h' is up to date.
CHK include/linux/utsrelease.h
CALL scripts/checksyscalls.sh
<stdin>:1097:2: warning: #warning syscall fadvise64 not implemented
<stdin>:1265:2: warning: #warning syscall migrate_pages not implemented
<stdin>:1321:2: warning: #warning syscall pselect6 not implemented
<stdin>:1325:2: warning: #warning syscall ppoll not implemented
<stdin>:1365:2: warning: #warning syscall epoll_pwait not implemented
<stdin>:1385:2: warning: #warning syscall fallocate not implemented

CC [M] drivers/net/ppp_generic.o
.
.
.
CC [M] drivers/net/pppox.o


net/ipv6/netfilter/ip6t_IMQ.c: In function `imq_target':
net/ipv6/netfilter/ip6t_IMQ.c:19: error: structure has no member named `imq_fla gs'
make[8]: * [net/ipv6/netfilter/ip6t_IMQ.o] Error 1
make[7]:
* [net/ipv6/netfilter] Error 2
make[6]: * [net/ipv6] Error 2 what is problem this...


scripts/kconfig/conf -s arch/arm/Kconfig
CHK include/linux/version.h
UPD include/linux/version.h
SYMLINK include/asm-arm/arch -> include/asm-arm/arch-ksz8695
Generating include/asm-arm/mach-types.h
CHK include/linux/utsrelease.h
UPD include/linux/utsrelease.h
SYMLINK include/asm -> include/asm-arm
CC arch/arm/kernel/asm-offsets.s
GEN include/asm-arm/asm-offsets.h
CALL scripts/checksyscalls.sh
<stdin>:1097:2: warning: #warning syscall fadvise64 not implemented
<stdin>:1265:2: warning: #warning syscall migrate_pages not implemented
<stdin>:1321:2: warning: #warning syscall pselect6 not implemented
<stdin>:1325:2: warning: #warning syscall ppoll not implemented
<stdin>:1365:2: warning: #warning syscall epoll_pwait not implemented
<stdin>:1385:2: warning: #warning syscall fallocate not implemented
CC scripts/mod/empty.o
HOSTCC scripts/mod/mk_elfconfig
MKELF scripts/mod/elfconfig.h
HOSTCC scripts/mod/file2alias.o
HOSTCC scripts/mod/modpost.o
HOSTCC scripts/mod/sumversion.o
HOSTLD scripts/mod/modpost
HOSTCC scripts/bin2c
make[5]: Leaving directory `/opt/OpenWRT/kamikaze_8.09_rc1/build_dir/linux-micr el_centaur_ksz8695p/linux-2.6.23.17'
rm -rf /opt/OpenWRT/kamikaze_8.09_rc1/build_dir/linux-micrel_centaur_ksz8695p/m odules
touch /opt/OpenWRT/kamikaze_8.09_rc1/build_dir/linux-micrel_centaur_ksz8695p/li nux-2.6.23.17/.configured
rm -f /opt/OpenWRT/kamikaze_8.09_rc1/build_dir/linux-micrel_centaur_ksz8695p/li nux-2.6.23.17/vmlinux /opt/OpenWRT/kamikaze_8.09_rc1/build_dir/linux-micrel_centaur_ksz8695p/linux-2.6.23.17/System.map
make -C /opt/OpenWRT/kamikaze_8.09_rc1/build_dir/linux-micrel_centaur_ksz8695p/ lin"ux-2.6.23.17 CROSS_COMPILE=""arm-linux-uclibc-"" ARCH=""arm"" KBUILD_HAVE_NLS=no CONFIG_SHELL=""/bin/bash"" CC=""arm-linux-uclibc-gcc"" modules"
make[5]: Entering directory `/opt/OpenWRT/kamikaze_8.09_rc1/build_dir/linux-mic rel_centaur_ksz8695p/linux-2.6.23.17'
CHK include/linux/version.h
make[6]: `include/asm-arm/mach-types.h' is up to date.
CHK include/linux/utsrelease.h
CALL scripts/checksyscalls.sh
<stdin>:1097:2: warning: #warning syscall fadvise64 not implemented
<stdin>:1265:2: warning: #warning syscall migrate_pages not implemented
<stdin>:1321:2: warning: #warning syscall pselect6 not implemented
<stdin>:1325:2: warning: #warning syscall ppoll not implemented
<stdin>:1365:2: warning: #warning syscall epoll_pwait not implemented
<stdin>:1385:2: warning: #warning syscall fallocate not implemented

CC [M] drivers/net/ppp_generic.o
.
.
.
CC [M] drivers/net/pppox.o


net/ipv6/netfilter/ip6t_IMQ.c: In function `imq_target':
net/ipv6/netfilter/ip6t_IMQ.c:19: error: structure has no member named `imq_fla gs'
make[8]: * [net/ipv6/netfilter/ip6t_IMQ.o] Error 1
make[7]:
* [net/ipv6/netfilter] Error 2
make[6]: * [net/ipv6] Error 2
make[5]:
* [net] Error 2
make[5]: Leaving directory `/opt/OpenWRT/kamikaze_8.09_rc1/build_dir/linux-micr el_ centaur_ksz8695p/linux-2.6.23.17'
make[4]: * /opt/OpenWRT/kamikaze_8.09_rc1/build_dir/linux-micrel_centaur_ksz Error 2
make[4]: Leaving directory `/opt/OpenWRT/openwrt-8.09/target/micrel_centaur'
make[3]:
* [compile] Error 2
make[3]: Leaving directory `/opt/OpenWRT/kamikaze_8.09_rc1/target/linux'
make[2]: * [target/linux/compile] Error 2
make[2]: Leaving directory `/opt/OpenWRT/kamikaze_8.09_rc1'
make[1]:
* /opt/OpenWRT/kamikaze_8.09_rc1/staging_dir/arm/stamp/.target_comp Error 2
make[1]: Leaving directory `/opt/OpenWRT/kamikaze_8.09_rc1'
make: * [world] Error 2

make[5]: * [net] Error 2
make[5]: Leaving directory `/opt/OpenWRT/kamikaze_8.09_rc1/build_dir/linux-micr el_ centaur_ksz8695p/linux-2.6.23.17'
make[4]:
* /opt/OpenWRT/kamikaze_8.09_rc1/build_dir/linux-micrel_centaur_ksz Error 2
make[4]: Leaving directory `/opt/OpenWRT/openwrt-8.09/target/micrel_centaur'
make[3]: * [compile] Error 2
make[3]: Leaving directory `/opt/OpenWRT/kamikaze_8.09_rc1/target/linux'
make[2]:
* [target/linux/compile] Error 2
make[2]: Leaving directory `/opt/OpenWRT/kamikaze_8.09_rc1'
make[1]: * /opt/OpenWRT/kamikaze_8.09_rc1/staging_dir/arm/stamp/.target_comp Error 2
make[1]: Leaving directory `/opt/OpenWRT/kamikaze_8.09_rc1'
make:
* [world] Error 2

Attachments (0)

Change History (5)

comment:1 Changed 9 years ago by anonymous


scripts/kconfig/conf -s arch/arm/Kconfig

CHK include/linux/version.h

UPD include/linux/version.h

SYMLINK include/asm-arm/arch -> include/asm-arm/arch-ksz8695

Generating include/asm-arm/mach-types.h

CHK include/linux/utsrelease.h

UPD include/linux/utsrelease.h

SYMLINK include/asm -> include/asm-arm

CC arch/arm/kernel/asm-offsets.s

GEN include/asm-arm/asm-offsets.h

CALL scripts/checksyscalls.sh

<stdin>:1097:2: warning: #warning syscall fadvise64 not implemented

<stdin>:1265:2: warning: #warning syscall migrate_pages not implemented

<stdin>:1321:2: warning: #warning syscall pselect6 not implemented

<stdin>:1325:2: warning: #warning syscall ppoll not implemented

<stdin>:1365:2: warning: #warning syscall epoll_pwait not implemented

<stdin>:1385:2: warning: #warning syscall fallocate not implemented

CC scripts/mod/empty.o

HOSTCC scripts/mod/mk_elfconfig

MKELF scripts/mod/elfconfig.h

HOSTCC scripts/mod/file2alias.o

HOSTCC scripts/mod/modpost.o

HOSTCC scripts/mod/sumversion.o

HOSTLD scripts/mod/modpost

HOSTCC scripts/bin2c

make[5]: Leaving directory `/opt/OpenWRT/kamikaze_8.09_rc1/build_dir/linux-micr

el_centaur_ksz8695p/linux-2.6.23.17'

rm -rf /opt/OpenWRT/kamikaze_8.09_rc1/build_dir/linux-micrel_centaur_ksz8695p/m

odules

touch /opt/OpenWRT/kamikaze_8.09_rc1/build_dir/linux-micrel_centaur_ksz8695p/li nux-
2.6.23.17/.configured

rm -f /opt/OpenWRT/kamikaze_8.09_rc1/build_dir/linux-micrel_centaur_ksz8695p/li nux-
2.6.23.17/vmlinux /opt/OpenWRT/kamikaze_8.09_rc1/build_dir/linux-
micrel_centaur_ksz8695p/linux-2.6.23.17/System.map

make -C /opt/OpenWRT/kamikaze_8.09_rc1/build_dir/linux-micrel_centaur_ksz8695p/

lin"ux-2.6.23.17 CROSS_COMPILE=""arm-linux-uclibc-"" ARCH=""arm""

KBUILD_HAVE_NLS=no CONFIG_SHELL=""/bin/bash"" CC=""arm-linux-uclibc-gcc"" modules"

make[5]: Entering directory `/opt/OpenWRT/kamikaze_8.09_rc1/build_dir/linux-mic

rel_centaur_ksz8695p/linux-2.6.23.17'

CHK include/linux/version.h

make[6]: `include/asm-arm/mach-types.h' is up to date.

CHK include/linux/utsrelease.h

CALL scripts/checksyscalls.sh

<stdin>:1097:2: warning: #warning syscall fadvise64 not implemented

<stdin>:1265:2: warning: #warning syscall migrate_pages not implemented

<stdin>:1321:2: warning: #warning syscall pselect6 not implemented

<stdin>:1325:2: warning: #warning syscall ppoll not implemented

<stdin>:1365:2: warning: #warning syscall epoll_pwait not implemented

<stdin>:1385:2: warning: #warning syscall fallocate not implemented

CC [M] drivers/net/ppp_generic.o

.

.

.

CC [M] drivers/net/pppox.o



net/ipv6/netfilter/ip6t_IMQ.c: In function `imq_target':

net/ipv6/netfilter/ip6t_IMQ.c:19: error: structure has no member named `imq_fla gs'

make[8]: * [net/ipv6/netfilter/ip6t_IMQ.o] Error 1

make[7]: * [net/ipv6/netfilter] Error 2

make[6]: * [net/ipv6] Error 2

make[5]: * [net] Error 2

make[5]: Leaving directory `/opt/OpenWRT/kamikaze_8.09_rc1/build_dir/linux-micr el_

centaur_ksz8695p/linux-2.6.23.17'

make[4]: * [/opt/OpenWRT/kamikaze_8.09_rc1/build_dir/linux-micrel_centaur_ksz 869

5p/linux-2.6.23.17/.modules] Error 2

make[4]: Leaving directory `/opt/OpenWRT/openwrt-8.09/target/micrel_centaur'

make[3]: * [compile] Error 2

make[3]: Leaving directory `/opt/OpenWRT/kamikaze_8.09_rc1/target/linux'

make[2]: * [target/linux/compile] Error 2

make[2]: Leaving directory `/opt/OpenWRT/kamikaze_8.09_rc1'

make[1]: * [/opt/OpenWRT/kamikaze_8.09_rc1/staging_dir/arm/stamp/.target_comp ile

] Error 2

make[1]: Leaving directory `/opt/OpenWRT/kamikaze_8.09_rc1'

make: * [world] Error 2

os is xubuntu 8.10

kernal 2.6

gcc 3.4.6

comment:2 Changed 9 years ago by sazajins@…

What wants problem, the knowing stamp...T.T
For a few days does can not solve..
Help me..

comment:3 Changed 9 years ago by florian

Which kernel version are you compiling for ? Disable IMQ in your kernel config if you do not want it to fail until it gets fixed.

comment:4 Changed 9 years ago by anonymous

kernel version is problem?
Must change this?

comment:5 Changed 9 years ago by nico

  • Description modified (diff)
  • Resolution set to invalid
  • Status changed from new to closed

The Micrel Centaur does not seem to be a supported target in OpenWrt.

Add Comment

Modify Ticket

Action
as closed .
The resolution will be deleted. Next status will be 'reopened'.
Author


E-mail address and user name can be saved in the Preferences.

 
Note: See TracTickets for help on using tickets.