Modify

Opened 9 years ago

Closed 9 years ago

#4301 closed defect (fixed)

gspcav1 build failure on x86-alix at r13492

Reported by: seniorr@… Owned by: developers
Priority: normal Milestone:
Component: packages Version:
Keywords: Cc:

Description

During a "Select all packages" build, found this:

make[3]: Entering directory `/aux2/src/openwrt/feeds/packages/multimedia/gspcav1'
gzip -dc /src_archive/openwrt/dl/gspcav1-20071224.tar.gz | /bin/tar -C /aux2/src/openwrt/build_dir/linux-x86_generic/gspcav1-20071224/.. -xf -
ls: cannot access ./patches: No such file or directory
touch /aux2/src/openwrt/build_dir/linux-x86_generic/gspcav1-20071224/.prepared_20c0574be5d44da1e7b19fdcae8bcf26
(cd /aux2/src/openwrt/build_dir/linux-x86_generic/gspcav1-20071224/./; if [ -x ./configure ]; then /usr/bin/X11/find /aux2/src/openwrt/build_dir/linux-x86_generic/gspcav1-20071224/ -name config.guess | xargs -r -n1 cp /aux2/src/openwrt/scripts/config.guess; /usr/bin/X11/find /aux2/src/openwrt/build_dir/linux-x86_generic/gspcav1-20071224/ -name config.sub | xargs -r -n1 cp /aux2/src/openwrt/scripts/config.sub; AR=i386-linux-uclibc-ar AS="i386-linux-uclibc-gcc -c -O2 -pipe -march=i486 -funit-at-a-time -fhonour-copts" LD=i386-linux-uclibc-ld NM=i386-linux-uclibc-nm CC="i386-linux-uclibc-gcc" GCC="i386-linux-uclibc-gcc" CXX="i386-linux-uclibc-g++" RANLIB=i386-linux-uclibc-ranlib STRIP=i386-linux-uclibc-strip OBJCOPY=i386-linux-uclibc-objcopy OBJDUMP=i386-linux-uclibc-objdump SIZE=i386-linux-uclibc-size CFLAGS="-O2 -pipe -march=i486 -funit-at-a-time -fhonour-copts " CXXFLAGS="-O2 -pipe -march=i486 -funit-at-a-time -fhonour-copts " CPPFLAGS="-I/aux2/src/openwrt/staging_dir/i386/usr/include -I/aux2/src/openwrt/staging_dir/i386/include " LDFLAGS="-L/aux2/src/openwrt/staging_dir/toolchain-i386_gcc4.1.2/lib -L/aux2/src/openwrt/staging_dir/i386/usr/lib -L/aux2/src/openwrt/staging_dir/i386/lib " PKG_CONFIG_PATH="/aux2/src/openwrt/staging_dir/i386/usr/lib/pkgconfig:/aux2/src/openwrt/staging_dir/host/usr/lib/pkgconfig" PKG_CONFIG_LIBDIR="/aux2/src/openwrt/staging_dir/i386/usr/lib/pkgconfig"  ./configure --target=i386-linux --host=i386-linux --build=i486-linux-gnu --program-prefix="" --program-suffix="" --prefix=/usr --exec-prefix=/usr --bindir=/usr/bin --sbindir=/usr/sbin --libexecdir=/usr/lib --sysconfdir=/etc --datadir=/usr/share --localstatedir=/var --mandir=/usr/man --infodir=/usr/info --disable-nls ; fi; )
touch /aux2/src/openwrt/build_dir/linux-x86_generic/gspcav1-20071224/.configured
make -C /aux2/src/openwrt/build_dir/linux-x86_generic/linux-2.6.27.7 ARCH="i386" CROSS_COMPILE="i386-linux-uclibc-" SUBDIRS="/aux2/src/openwrt/build_dir/linux-x86_generic/gspcav1-20071224" modules
make[4]: Entering directory `/aux2/src/openwrt/build_dir/linux-x86_generic/linux-2.6.27.7'
  CC [M]  /aux2/src/openwrt/build_dir/linux-x86_generic/gspcav1-20071224/gspca_core.o
/aux2/src/openwrt/build_dir/linux-x86_generic/gspcav1-20071224/gspca_core.c:54:27: error: asm/semaphore.h: No such file or directory
/aux2/src/openwrt/build_dir/linux-x86_generic/gspcav1-20071224/gspca_core.c: In function 'spca5xx_ioctl':
/aux2/src/openwrt/build_dir/linux-x86_generic/gspcav1-20071224/gspca_core.c:2463: error: implicit declaration of function 'video_usercopy'
/aux2/src/openwrt/build_dir/linux-x86_generic/gspcav1-20071224/gspca_core.c: At top level:
/aux2/src/openwrt/build_dir/linux-x86_generic/gspcav1-20071224/gspca_core.c:2609: error: unknown field 'owner' specified in initializer
/aux2/src/openwrt/build_dir/linux-x86_generic/gspcav1-20071224/gspca_core.c:2609: warning: initialization from incompatible pointer type
/aux2/src/openwrt/build_dir/linux-x86_generic/gspcav1-20071224/gspca_core.c:2611: error: unknown field 'type' specified in initializer
/aux2/src/openwrt/build_dir/linux-x86_generic/gspcav1-20071224/gspca_core.c: In function 'spca50x_create_sysfs':
/aux2/src/openwrt/build_dir/linux-x86_generic/gspcav1-20071224/gspca_core.c:2769: error: implicit declaration of function 'video_device_create_file'
/aux2/src/openwrt/build_dir/linux-x86_generic/gspcav1-20071224/gspca_core.c:2780: error: implicit declaration of function 'video_device_remove_file'
/aux2/src/openwrt/build_dir/linux-x86_generic/gspcav1-20071224/gspca_core.c: In function 'spca5xx_probe':
/aux2/src/openwrt/build_dir/linux-x86_generic/gspcav1-20071224/gspca_core.c:4301: error: incompatible types in assignment
make[5]: *** [/aux2/src/openwrt/build_dir/linux-x86_generic/gspcav1-20071224/gspca_core.o] Error 1
make[4]: *** [_module_/aux2/src/openwrt/build_dir/linux-x86_generic/gspcav1-20071224] Error 2
make[4]: Leaving directory `/aux2/src/openwrt/build_dir/linux-x86_generic/linux-2.6.27.7'
make[3]: *** [/aux2/src/openwrt/build_dir/linux-x86_generic/gspcav1-20071224/.built] Error 2
make[3]: Leaving directory `/aux2/src/openwrt/feeds/packages/multimedia/gspcav1'
make[2]: *** [package/feeds/packages/gspcav1/compile] Error 2
make[2]: Leaving directory `/aux2/src/openwrt'
make[1]: *** [/aux2/src/openwrt/staging_dir/i386/stamp/.package_compile] Error 2
make[1]: Leaving directory `/aux2/src/openwrt'
make: *** [world] Error 2

Attachments (0)

Change History (2)

comment:1 Changed 9 years ago by morpheus

same here

comment:2 Changed 9 years ago by florian

  • Resolution set to fixed
  • Status changed from new to closed

gspca1 does not build with newer kernels, it was masked with [13997].

Add Comment

Modify Ticket

Action
as closed .
The resolution will be deleted. Next status will be 'reopened'.
Author


E-mail address and user name can be saved in the Preferences.

 
Note: See TracTickets for help on using tickets.