Modify

Opened 12 years ago

Closed 12 years ago

Last modified 4 years ago

#426 closed defect (fixed)

mutt-1.4.2.1 doesn't build (trunk r3522)

Reported by: tristan@… Owned by: florian
Priority: normal Milestone: Barrier Breaker 14.07
Component: packages Version:
Keywords: Cc:

Description

Building for aruba on a Fedora Core 2 box.

make[7]: Entering directory `/data2/openwrt/tristan/trunk/openwrt/build_mips/mutt-1.4.2.1'
/data2/openwrt/tristan/trunk/openwrt/staging_dir_mips/bin/mips-linux-uclibc-gcc -DPKGDATADIR=\"/usr/share/mutt\" -DSYSCONFDIR=\"/etc\"  -DBINDIR=\"/usr/bin\" -DMUTTLOCALEDIR=\"/usr/share/locale\"     -DHAVE_CONFIG_H=1 -I. -I. -I./imap -Iintl -I/data2/openwrt/tristan/trunk/openwrt/staging_dir_mips/usr/include -I/data2/openwrt/tristan/trunk/openwrt/staging_dir_mips/include -I/usr/include/ncurses -I./intl -I.  -Wall -pedantic -Os -pipe -mips32 -mtune=mips32 -funit-at-a-time  -c patchlist.c
/data2/openwrt/tristan/trunk/openwrt/staging_dir_mips/bin/mips-linux-uclibc-gcc -DPKGDATADIR=\"/usr/share/mutt\" -DSYSCONFDIR=\"/etc\"  -DBINDIR=\"/usr/bin\" -DMUTTLOCALEDIR=\"/usr/share/locale\"     -DHAVE_CONFIG_H=1 -I. -I. -I./imap -Iintl  -I/data2/openwrt/tristan/trunk/o
penwrt/staging_dir_mips/usr/include -I/data2/openwrt/tristan/trunk/openwrt/staging_dir_mips/include -I/usr/include/ncurses -I./intl -I.  -Wall -pedantic -Os -pipe -mips32 -mtune=mips32 -funit-at-a-time  -c addrbook.c
In file included from mutt_menu.h:23,
                 from addrbook.c:20:
keymap.h:83: error: array type has incomplete element type
addrbook.c: In function 'mutt_alias_menu':
addrbook.c:166: warning: dereferencing type-punned pointer will break strict-aliasing rules
addrbook.c:235: warning: dereferencing type-punned pointer will break strict-aliasing rules
make[7]: *** [addrbook.o] Error 1
make[7]: Leaving directory `/data2/openwrt/tristan/trunk/openwrt/build_mips/mutt-1.4.2.1'
make[6]: *** [all-recursive] Error 1
make[6]: Leaving directory `/data2/openwrt/tristan/trunk/openwrt/build_mips/mutt-1.4.2.1'
make[5]: *** [all-recursive-am] Error 2
make[5]: Leaving directory `/data2/openwrt/tristan/trunk/openwrt/build_mips/mutt-1.4.2.1'
make[4]: *** [/data2/openwrt/tristan/trunk/openwrt/build_mips/mutt-1.4.2.1/.built] Error 2
make[4]: Leaving directory `/data2/openwrt/tristan/trunk/openwrt/package/mutt'
make[3]: *** [compile] Error 2
make[3]: Leaving directory `/data2/openwrt/tristan/trunk/openwrt/package/mutt'
make[2]: *** [mutt-compile] Error 2

Attachments (0)

Change History (4)

comment:1 Changed 12 years ago by florian

  • Owner changed from developers to florian
  • Status changed from new to assigned

comment:2 Changed 12 years ago by kaloz

  • Milestone set to 2.0

comment:3 Changed 12 years ago by florian

  • Resolution set to fixed
  • Status changed from assigned to closed

Upgrading to mutt-1.5.11 fixed the problem in [3546]

comment:4 Changed 4 years ago by jow

  • Milestone changed from Attitude Adjustment 12.09 to Barrier Breaker 14.07

Milestone Attitude Adjustment 12.09 deleted

Add Comment

Modify Ticket

Action
as closed .
The resolution will be deleted. Next status will be 'reopened'.
Author


E-mail address and user name can be saved in the Preferences.

 
Note: See TracTickets for help on using tickets.