Modify

Opened 9 years ago

Closed 9 years ago

#4013 closed defect (fixed)

gnome-python-desktop r12616 build failure on x86 alix

Reported by: seniorr@… Owned by: developers
Priority: normal Milestone:
Component: packages Version:
Keywords: Cc:

Description

I just did a build-all packages or r12616 for x86 alix. This is one of the build failures.

make[6]: Entering directory `/aux2/src/openwrt/build/r12616/build_dir/i386/gnome-python-desktop-2.22.0/rsvg'
/bin/sh ../libtool --tag=CC   --mode=compile i386-linux-uclibc-gcc -DHAVE_CONFIG_H -I. -I.. -I/aux2/src/openwrt/build/r12616/staging_dir/i386/usr/include/python2.5 -DDISABLE_THREADING -I/aux2/src/openwrt/
mkdir .libs
 i386-linux-uclibc-gcc -DHAVE_CONFIG_H -I. -I.. -I/aux2/src/openwrt/build/r12616/staging_dir/i386/usr/include/python2.5 -DDISABLE_THREADING -I/aux2/src/openwrt/build/r12616/staging_dir/i386/usr/include/li
rsvgmodule.c:5:21: error: pycairo.h: No such file or directory
rsvgmodule.c:8: error: expected '=', ',', ';', 'asm' or '__attribute__' before '*' token
rsvgmodule.c: In function 'initrsvg':
rsvgmodule.c:24: error: 'Pycairo_IMPORT' undeclared (first use in this function)
rsvgmodule.c:24: error: (Each undeclared identifier is reported only once
rsvgmodule.c:24: error: for each function it appears in.)
make[6]: *** [rsvgmodule.lo] Error 1
make[6]: Leaving directory `/aux2/src/openwrt/build/r12616/build_dir/i386/gnome-python-desktop-2.22.0/rsvg'
make[5]: *** [all-recursive] Error 1
make[5]: Leaving directory `/aux2/src/openwrt/build/r12616/build_dir/i386/gnome-python-desktop-2.22.0'
make[4]: *** [all] Error 2
make[4]: Leaving directory `/aux2/src/openwrt/build/r12616/build_dir/i386/gnome-python-desktop-2.22.0'
make[3]: *** [/aux2/src/openwrt/build/r12616/build_dir/i386/gnome-python-desktop-2.22.0/.built] Error 2
make[3]: Leaving directory `/aux2/src/openwrt/packages/lang/python-gnome-desktop2'
make[2]: *** [package/python-gnome-desktop2/compile] Error 2
make[2]: Leaving directory `/aux2/src/openwrt/build/r12616'
make[1]: *** [/aux2/src/openwrt/build/r12616/staging_dir/i386/stamp/.package_compile] Error 2
make[1]: Leaving directory `/aux2/src/openwrt/build/r12616'
make: *** [world] Error 2

Attachments (0)

Change History (1)

comment:1 Changed 9 years ago by lars

  • Resolution set to fixed
  • Status changed from new to closed

fixed in r12620

Add Comment

Modify Ticket

Action
as closed .
The resolution will be deleted. Next status will be 'reopened'.
Author


E-mail address and user name can be saved in the Preferences.

 
Note: See TracTickets for help on using tickets.