Opened 10 years ago

Closed 10 years ago

#3083 closed defect (fixed)

libcurl fails to compile because file not found

Reported by: zioproto@… Owned by: developers
Priority: normal Milestone:
Component: packages Version:
Keywords: curl libcurl Cc: clauz@…, nino@…


Compilation exits here:

make[3] -C feeds/packages/libs/curl compile

Script is complaining about the file not found ( I used make V=99 to see the error)

I fixed on my gentoo Linux with this workaround;

ln -s /lib/ /lib/

Attachments (0)

Change History (2)

comment:1 Changed 10 years ago by zobel@…

I can reproduce that error here as well...

checking whether to enable support for cookies... yes
checking whether to enable hidden symbols in the library... no
configure: creating ./config.status
/bin/sh: error while loading shared libraries: cannot open shared object file: No such file or directory
make[3]: *** [/org/openwrt/soekris/build_dir/i386/curl-7.17.1/.configured] Error 1
make[3]: Leaving directory `/org/openwrt/packages/libs/curl'
make[2]: *** [package/curl/compile] Error 2

comment:2 Changed 10 years ago by florian

  • Resolution set to fixed
  • Status changed from new to closed

Should be fixed with [10712].

Add Comment

Modify Ticket

as closed .
The resolution will be deleted. Next status will be 'reopened'.

E-mail address and user name can be saved in the Preferences.

Note: See TracTickets for help on using tickets.