Modify

Opened 9 months ago

#24923 new defect

Openwrt 15.05.1 for mt7621: build error with SDK

Reported by: pparent Owned by: developers
Priority: normal Milestone:
Component: base system Version: Chaos Calmer 15.05
Keywords: Cc:

Description

After downloading the SDK for Openwrt 15.05.1 for mt7621

I do:
./scripts/feeds update -a
./scripts/feeds install kmod-mac80211
make package/mac80211/compile -j V=s

I get:

make[2] -C feeds/base/package/firmware/ath10k-firmware compile
[...]
converted 'http://downloads.openwrt.org/sources/board-2.bin.ddcec9efd245da9365c474f513a855a55f3ac7fe' (ANSI_X3.4-1968) -> 'http://downloads.openwrt.org/sources/board-2.bin.ddcec9efd245da9365c474f513a855a55f3ac7fe' (UTF-8)
--2017-05-22 16:24:09--  http://downloads.openwrt.org/sources/board-2.bin.ddcec9efd245da9365c474f513a855a55f3ac7fe
Resolving downloads.openwrt.org (downloads.openwrt.org)... 78.24.191.177
Connecting to downloads.openwrt.org (downloads.openwrt.org)|78.24.191.177|:80... connected.
HTTP request sent, awaiting response... 404 Not Found
2017-05-22 16:24:09 ERROR 404: Not Found.

Download failed.
No more mirrors to try - giving up


I decive to remove from menuconfig
ath10k-firmware-qca6174 ath10k-firmware-qca988x ath10k-firmware-qca99x0 kmod-ath10k

I get then the following error:

make[2]: Leaving directory '/home/pparent/code/15.05.1/3/OpenWrt-SDK-15.05.1-ramips-mt7621_gcc-4.8-linaro_uClibc-0.9.33.2.Linux-x86_64/feeds/base/package/kernel/linux'
make[2]: Entering directory '/home/pparent/code/15.05.1/3/OpenWrt-SDK-15.05.1-ramips-mt7621_gcc-4.8-linaro_uClibc-0.9.33.2.Linux-x86_64/feeds/base/package/kernel/mac80211'
Makefile:621: warning: overriding recipe for target '/home/pparent/code/15.05.1/3/OpenWrt-SDK-15.05.1-ramips-mt7621_gcc-4.8-linaro_uClibc-0.9.33.2.Linux-x86_64/dl/broadcom-wl-5.100.138.tar.bz2'
Makefile:321: warning: ignoring old recipe for target '/home/pparent/code/15.05.1/3/OpenWrt-SDK-15.05.1-ramips-mt7621_gcc-4.8-linaro_uClibc-0.9.33.2.Linux-x86_64/dl/broadcom-wl-5.100.138.tar.bz2'
rm -f /home/pparent/code/15.05.1/3/OpenWrt-SDK-15.05.1-ramips-mt7621_gcc-4.8-linaro_uClibc-0.9.33.2.Linux-x86_64/staging_dir/target-mipsel_1004kc+dsp_uClibc-0.9.33.2/stamp/.mac80211_installed
Makefile:1766: recipe for target '/home/pparent/code/15.05.1/3/OpenWrt-SDK-15.05.1-ramips-mt7621_gcc-4.8-linaro_uClibc-0.9.33.2.Linux-x86_64/build_dir/target-mipsel_1004kc+dsp_uClibc-0.9.33.2/linux-ramips_mt7621/compat-wireless-2016-01-10/.configured_yyyyyyynyyyyynyyyyyyyyyyyyyyyyyynyyyyyyyyyynyyyyyyyyyyyyyynnnyyynynnyyyyynnnnyynn' failed
make[2]: [/home/pparent/code/15.05.1/3/OpenWrt-SDK-15.05.1-ramips-mt7621_gcc-4.8-linaro_uClibc-0.9.33.2.Linux-x86_64/build_dir/target-mipsel_1004kc+dsp_uClibc-0.9.33.2/linux-ramips_mt7621/compat-wireless-2016-01-10/.configured_yyyyyyynyyyyynyyyyyyyyyyyyyyyyyynyyyyyyyyyynyyyyyyyyyyyyyynnnyyynynnyyyyynnnnyynn] Error 123 (ignored)
cmp /home/pparent/code/15.05.1/3/OpenWrt-SDK-15.05.1-ramips-mt7621_gcc-4.8-linaro_uClibc-0.9.33.2.Linux-x86_64/build_dir/target-mipsel_1004kc+dsp_uClibc-0.9.33.2/linux-ramips_mt7621/compat-wireless-2016-01-10/include/linux/ath9k_platform.h /home/pparent/code/15.05.1/3/OpenWrt-SDK-15.05.1-ramips-mt7621_gcc-4.8-linaro_uClibc-0.9.33.2.Linux-x86_64/build_dir/target-mipsel_1004kc+dsp_uClibc-0.9.33.2/linux-ramips_mt7621/linux-3.18.23/include/linux/ath9k_platform.h
/home/pparent/code/15.05.1/3/OpenWrt-SDK-15.05.1-ramips-mt7621_gcc-4.8-linaro_uClibc-0.9.33.2.Linux-x86_64/build_dir/target-mipsel_1004kc+dsp_uClibc-0.9.33.2/linux-ramips_mt7621/compat-wireless-2016-01-10/include/linux/ath9k_platform.h /home/pparent/code/15.05.1/3/OpenWrt-SDK-15.05.1-ramips-mt7621_gcc-4.8-linaro_uClibc-0.9.33.2.Linux-x86_64/build_dir/target-mipsel_1004kc+dsp_uClibc-0.9.33.2/linux-ramips_mt7621/linux-3.18.23/include/linux/ath9k_platform.h differ: char 1267, line 39
Makefile:1766: recipe for target '/home/pparent/code/15.05.1/3/OpenWrt-SDK-15.05.1-ramips-mt7621_gcc-4.8-linaro_uClibc-0.9.33.2.Linux-x86_64/build_dir/target-mipsel_1004kc+dsp_uClibc-0.9.33.2/linux-ramips_mt7621/compat-wireless-2016-01-10/.configured_yyyyyyynyyyyynyyyyyyyyyyyyyyyyyynyyyyyyyyyynyyyyyyyyyyyyyynnnyyynynnyyyyynnnnyynn' failed
make[2]: *** [/home/pparent/code/15.05.1/3/OpenWrt-SDK-15.05.1-ramips-mt7621_gcc-4.8-linaro_uClibc-0.9.33.2.Linux-x86_64/build_dir/target-mipsel_1004kc+dsp_uClibc-0.9.33.2/linux-ramips_mt7621/compat-wireless-2016-01-10/.configured_yyyyyyynyyyyynyyyyyyyyyyyyyyyyyynyyyyyyyyyynyyyyyyyyyyyyyynnnyyynynnyyyyynnnnyynn] Error 1
make[2]: Leaving directory '/home/pparent/code/15.05.1/3/OpenWrt-SDK-15.05.1-ramips-mt7621_gcc-4.8-linaro_uClibc-0.9.33.2.Linux-x86_64/feeds/base/package/kernel/mac80211'
package/Makefile:191: recipe for target 'package/feeds/base/mac80211/compile' failed
make[1]: *** [package/feeds/base/mac80211/compile] Error 2
make[1]: Leaving directory '/home/pparent/code/15.05.1/3/OpenWrt-SDK-15.05.1-ramips-mt7621_gcc-4.8-linaro_uClibc-0.9.33.2.Linux-x86_64'
/home/pparent/code/15.05.1/3/OpenWrt-SDK-15.05.1-ramips-mt7621_gcc-4.8-linaro_uClibc-0.9.33.2.Linux-x86_64/include/toplevel.mk:174: recipe for target 'package/mac80211/compile' failed
make: *** [package/mac80211/compile] Error 2

Attachments (0)

Change History (0)

Add Comment

Modify Ticket

Action
as new .
Author


E-mail address and user name can be saved in the Preferences.

 
Note: See TracTickets for help on using tickets.