Modify

Opened 10 years ago

Closed 10 years ago

Last modified 4 years ago

#2308 closed defect (worksforme)

gcc 4.1.2 compilation failure

Reported by: minev.risto@… Owned by: developers
Priority: high Milestone: Barrier Breaker 14.07
Component: toolchain Version:
Keywords: gcc 4.1.2 Cc:

Description

/home/comacsd.projects/risto/open_wrt/toolchain_build_powerpc/gcc-4.1.2-initial/./gcc/xgcc -B/home/comacsd.projects/risto/open_wrt/toolchain_build_powerpc/gcc-4.1.2-initial/./gcc/ -B/home/comacsd.projects/risto/open_wrt/staging_dir_powerpc/powerpc-linux-uclibc/bin/ -B/home/comacsd.projects/risto/open_wrt/staging_dir_powerpc/powerpc-linux-uclibc/lib/ -isystem /home/comacsd.projects/risto/open_wrt/staging_dir_powerpc/powerpc-linux-uclibc/include -isystem /home/comacsd.projects/risto/open_wrt/staging_dir_powerpc/powerpc-linux-uclibc/sys-include -O2 -g -Os -DIN_GCC -DCROSS_COMPILE -W -Wall -Wwrite-strings -Wstrict-prototypes -Wmissing-prototypes -Wold-style-definition -isystem ./include -fPIC -g -DHAVE_GTHR_DEFAULT -DIN_LIBGCC2 -DGCC_FLOAT_NOT_NEEDED -I. -I. -I/home/comacsd.projects/risto/open_wrt/toolchain_build_powerpc/gcc-4.1.2/gcc -I/home/comacsd.projects/risto/open_wrt/toolchain_build_powerpc/gcc-4.1.2/gcc/. -I/home/comacsd.projects/risto/open_wrt/toolchain_build_powerpc/gcc-4.1.2/gcc/../include -I/home/comacsd.projects/risto/open_wrt/toolchain_build_powerpc/gcc-4.1.2/gcc/../libcpp/include -DFINE_GRAINED_LIBRARIES -fPIC -mstrict-align -DL_addsub_df -c dp-bit.c -o libgcc/./_addsub_df.o
dp-bit.c: In function '_fpadd_parts':
dp-bit.c:621: internal compiler error: Segmentation fault
Please submit a full bug report,
with preprocessed source if appropriate.
See <URL:https://dev.openwrt.org/> for instructions.
make[6]: * [libgcc/./_addsub_df.o] Error 1
make[6]: Leaving directory `/home/comacsd.projects/risto/open_wrt/toolchain_build_powerpc/gcc-4.1.2-initial/gcc'
make[5]:
* [stmp-multilib] Error 2
make[5]: Leaving directory `/home/comacsd.projects/risto/open_wrt/toolchain_build_powerpc/gcc-4.1.2-initial/gcc'
make[4]: * [all-gcc] Error 2
make[4]: Leaving directory `/home/comacsd.projects/risto/open_wrt/toolchain_build_powerpc/gcc-4.1.2-initial'
make[3]:
* /home/comacsd.projects/risto/open_wrt/toolchain_build_powerpc/gcc-4.1.2/.built Error 2
make[3]: Leaving directory `/home/comacsd.projects/risto/open_wrt/toolchain/gcc'
make[2]: * [gcc-compile] Error 2
make[2]: Leaving directory `/home/comacsd.projects/risto/open_wrt/toolchain'
make[1]:
* [toolchain/install] Error 2
make[1]: Leaving directory `/home/comacsd.projects/risto/open_wrt'
make: * [world] Error 2

Attachments (0)

Change History (4)

comment:1 Changed 10 years ago by florian

Can you be more specific towards your host : distribution, host gcc version ... Thanks in advance.

comment:2 Changed 10 years ago by nbd

  • Resolution set to worksforme
  • Status changed from new to closed

bug response timeout

comment:3 Changed 9 years ago by tim.kornhammar@…

I get the same error. Trying to build the ps3-version (ppc) on Ubuntu Intrepid 64-bit.

/home/tim/openwrt/build_dir/toolchain-powerpc_gcc4.1.2/gcc-4.1.2-initial/./gcc/xgcc -B/home/tim/openwrt/build_dir/toolchain-powerpc_gcc4.1.2/gcc-4.1.2-initial/./gcc/ -B/home/tim/openwrt/staging_dir/toolchain-powerpc_gcc4.1.2/powerpc-linux-uclibc/bin/ -B/home/tim/openwrt/staging_dir/toolchain-powerpc_gcc4.1.2/powerpc-linux-uclibc/lib/ -isystem /home/tim/openwrt/staging_dir/toolchain-powerpc_gcc4.1.2/powerpc-linux-uclibc/include -isystem /home/tim/openwrt/staging_dir/toolchain-powerpc_gcc4.1.2/powerpc-linux-uclibc/sys-include -O2  -g -Os -DIN_GCC -DCROSS_COMPILE   -W -Wall -Wwrite-strings -Wstrict-prototypes -Wmissing-prototypes -Wold-style-definition  -isystem ./include  -fPIC -g -DHAVE_GTHR_DEFAULT -DIN_LIBGCC2 -D__GCC_FLOAT_NOT_NEEDED  -I. -I. -I/home/tim/openwrt/build_dir/toolchain-powerpc_gcc4.1.2/gcc-4.1.2/gcc -I/home/tim/openwrt/build_dir/toolchain-powerpc_gcc4.1.2/gcc-4.1.2/gcc/. -I/home/tim/openwrt/build_dir/toolchain-powerpc_gcc4.1.2/gcc-4.1.2/gcc/../include -I/home/tim/openwrt/build_dir/toolchain-powerpc_gcc4.1.2/gcc-4.1.2/gcc/../libcpp/include  -DFINE_GRAINED_LIBRARIES -DL_addsub_df -c dp-bit.c -o libgcc/./_addsub_df.o
<built-in>:0: note: someone does not honour COPTS correctly, passed 0 times
dp-bit.c: In function '_fpadd_parts':
dp-bit.c:621: internal compiler error: Segmentation fault
Please submit a full bug report,
with preprocessed source if appropriate.
See <URL:https://dev.openwrt.org/> for instructions.
make[6]: *** [libgcc/./_addsub_df.o] Error 1
make[6]: Leaving directory `/home/tim/openwrt/build_dir/toolchain-powerpc_gcc4.1.2/gcc-4.1.2-initial/gcc'
make[5]: *** [stmp-multilib] Error 2
make[5]: Leaving directory `/home/tim/openwrt/build_dir/toolchain-powerpc_gcc4.1.2/gcc-4.1.2-initial/gcc'
make[4]: *** [all-gcc] Error 2
make[4]: Leaving directory `/home/tim/openwrt/build_dir/toolchain-powerpc_gcc4.1.2/gcc-4.1.2-initial'
make[3]: *** [/home/tim/openwrt/staging_dir/toolchain-powerpc_gcc4.1.2/stamp/.gcc-initial_installed] Error 2
make[3]: Leaving directory `/home/tim/openwrt/toolchain/gcc'
make[2]: *** [toolchain/gcc/compile] Error 2
make[2]: Leaving directory `/home/tim/openwrt'
make[1]: *** [/home/tim/openwrt/staging_dir/powerpc/stamp/.toolchain_install] Error 2
make[1]: Leaving directory `/home/tim/openwrt'

comment:4 Changed 4 years ago by jow

  • Milestone changed from Attitude Adjustment 12.09 to Barrier Breaker 14.07

Milestone Attitude Adjustment 12.09 deleted

Add Comment

Modify Ticket

Action
as closed .
The resolution will be deleted. Next status will be 'reopened'.
Author


E-mail address and user name can be saved in the Preferences.

 
Note: See TracTickets for help on using tickets.