Modify

Opened 22 months ago

Last modified 21 months ago

#22284 new defect

Compile error

Reported by: DocMAX Owned by: developers
Priority: normal Milestone:
Component: packages Version: Trunk
Keywords: Cc:

Description

install -d -m0755 /home/docmax/openwrt/trunk/build_dir/target-mips_34kc+dsp_musl-1.1.14/root-lantiq/tmp /home/docmax/openwrt/trunk/build_dir/target-mips_34kc+dsp_musl-1.1.14/root-lantiq/overlay
chmod 1777 /home/docmax/openwrt/trunk/build_dir/target-mips_34kc+dsp_musl-1.1.14/root-lantiq/tmp
rm -f /home/docmax/openwrt/trunk/build_dir/target-mips_34kc+dsp_musl-1.1.14/linux-lantiq_xway/WBMRB-kernel.bin
cp /home/docmax/openwrt/trunk/build_dir/target-mips_34kc+dsp_musl-1.1.14/linux-lantiq_xway/vmlinux /home/docmax/openwrt/trunk/build_dir/target-mips_34kc+dsp_musl-1.1.14/linux-lantiq_xway/WBMRB-kernel.bin
mips-openwrt-linux-musl-cpp -nostdinc -x assembler-with-cpp -I/home/docmax/openwrt/trunk/build_dir/target-mips_34kc+dsp_musl-1.1.14/linux-lantiq_xway/linux-4.4.7/arch/mips/boot/dts -I/home/docmax/openwrt/trunk/build_dir/target-mips_34kc+dsp_musl-1.1.14/linux-lantiq_xway/linux-4.4.7/arch/mips/boot/dts/include -undef -D__DTS__  -o /home/docmax/openwrt/trunk/build_dir/target-mips_34kc+dsp_musl-1.1.14/linux-lantiq_xway/WBMRB-kernel.bin.dtb.tmp ../dts/WBMRB.dts
mips-openwrt-linux-musl-cpp: error: ../dts/WBMRB.dts: No such file or directory
mips-openwrt-linux-musl-cpp: warning: '-x assembler-with-cpp' after last input file has no effect
mips-openwrt-linux-musl-cpp: fatal error: no input files
compilation terminated.
make[5]: *** [/home/docmax/openwrt/trunk/build_dir/target-mips_34kc+dsp_musl-1.1.14/linux-lantiq_xway/WBMRB-kernel.bin] Error 1
make[5]: Leaving directory `/home/docmax/openwrt/trunk/target/linux/lantiq/image'
make[4]: *** [install] Error 2
make[4]: Leaving directory `/home/docmax/openwrt/trunk/target/linux/lantiq'
make[3]: *** [install] Error 2
make[3]: Leaving directory `/home/docmax/openwrt/trunk/target/linux'
make[2]: *** [target/linux/install] Error 2
make[2]: Leaving directory `/home/docmax/openwrt/trunk'
make[1]: *** [/home/docmax/openwrt/trunk/staging_dir/target-mips_34kc+dsp_musl-1.1.14/stamp/.target_install] Error 2
make[1]: Leaving directory `/home/docmax/openwrt/trunk'
make: *** [world] Fehler 2

Attachments (0)

Change History (4)

comment:1 Changed 21 months ago by jospezial

That is why the buildbot fails for lantiq
http://buildbot.openwrt.org:8010/builders/lantiq/builds/282/steps/compile_8/logs/stdio

and there are no new images in
https://downloads.openwrt.org/snapshots/trunk/lantiq/generic/
Last one is from 21-Apr-2016 with old image naming format.

comment:2 Changed 21 months ago by t0t3m1n

Same problem compiling r49264 for Buffalo WBMR-HP-G300H Annex A, i think the problem is commit [49210], for both models (Annex A and Annex B) there's a single WBMR.dts defined in target/linux/lantiq/dts, the lantiqImage function in target/linux/lantiq/image/Makefile set DEVICE_DTS to WBMRA or WBMRB, so the build fails because there aren't WBMRA.dts or WBMRB.dts files in target/linux/lantiq/dts. In my case I temporary fixed the problem creating a symbolic link WBMRA.dts to WBMR.dts in target/linux/lantiq/dts.

comment:4 Changed 21 months ago by DocMAX

Still doesnt work

mips-openwrt-linux-musl-cpp: error: ../dts/WBMRA.dts: No such file or directory

Add Comment

Modify Ticket

Action
as new .
Author


E-mail address and user name can be saved in the Preferences.

 
Note: See TracTickets for help on using tickets.