Modify

Opened 3 years ago

Closed 3 years ago

#20013 closed defect (moved_to_github)

mtr compile failed ?

Reported by: anonymous Owned by: developers
Priority: normal Milestone: Chaos Calmer 15.05
Component: packages Version: Trunk
Keywords: mtr Cc:

Description

make[6]: Entering directory '/home/testlab/trunk/build_dir/target-mips_34kc_musl-1.1.10/mtr-0.85+newdns-dd2b750/img'
make[6]: Nothing to be done for 'all'.
make[6]: Leaving directory '/home/testlab/trunk/build_dir/target-mips_34kc_musl-1.1.10/mtr-0.85+newdns-dd2b750/img'
make[6]: Entering directory '/home/testlab/trunk/build_dir/target-mips_34kc_musl-1.1.10/mtr-0.85+newdns-dd2b750'
mips-openwrt-linux-musl-gcc -DHAVE_CONFIG_H  -I.   -I/home/testlab/trunk/staging_dir/target-mips_34kc_musl-1.1.10/usr/include -I/home/testlab/trunk/staging_dir/target-mips_34kc_musl-1.1.10/include -I/home/testlab/trunk/staging_dir/toolchain-mips_34kc_gcc-4.8-linaro_musl-1.1.10/usr/include -I/home/testlab/trunk/staging_dir/toolchain-mips_34kc_gcc-4.8-linaro_musl-1.1.10/include/fortify -I/home/testlab/trunk/staging_dir/toolchain-mips_34kc_gcc-4.8-linaro_musl-1.1.10/include   -O3 -pipe -mno-branch-likely -mips32r2 -mtune=34kc -fno-caller-saves -fhonour-copts -Wno-error=unused-but-set-variable -msoft-float  -Wall -Wno-pointer-sign -MT net.o -MD -MP -MF .deps/net.Tpo -c -o net.o net.c
net.c: In function 'net_send_tcp':
net.c:312:24: warning: unused variable 'remote6' [-Wunused-variable]
   struct sockaddr_in6 *remote6 = (struct sockaddr_in6 *) &remote;
                        ^
net.c:310:24: warning: unused variable 'local6' [-Wunused-variable]
   struct sockaddr_in6 *local6 = (struct sockaddr_in6 *) &local;
                        ^
net.c: In function 'net_send_query':
net.c:570:37: error: invalid application of 'sizeof' to incomplete type 'struct ip6_hdr'
   ( ( af == AF_INET ) ? 0 : sizeof (struct ip6_hdr) );
                                     ^
Makefile:499: recipe for target 'net.o' failed
make[6]: *** [net.o] Error 1
make[6]: Leaving directory '/home/testlab/trunk/build_dir/target-mips_34kc_musl-1.1.10/mtr-0.85+newdns-dd2b750'
Makefile:562: recipe for target 'all-recursive' failed
make[5]: *** [all-recursive] Error 1
make[5]: Leaving directory '/home/testlab/trunk/build_dir/target-mips_34kc_musl-1.1.10/mtr-0.85+newdns-dd2b750'
Makefile:377: recipe for target 'all' failed
make[4]: *** [all] Error 2
make[4]: Leaving directory '/home/testlab/trunk/build_dir/target-mips_34kc_musl-1.1.10/mtr-0.85+newdns-dd2b750'
Makefile:73: recipe for target '/home/testlab/trunk/build_dir/target-mips_34kc_musl-1.1.10/mtr-0.85+newdns-dd2b750/.built' failed
make[3]: *** [/home/testlab/trunk/build_dir/target-mips_34kc_musl-1.1.10/mtr-0.85+newdns-dd2b750/.built] Error 2
make[3]: Leaving directory '/home/testlab/trunk/feeds/packages/net/mtr'
package/Makefile:191: recipe for target 'package/feeds/packages/mtr/compile' failed
make[2]: *** [package/feeds/packages/mtr/compile] Error 2
make[2]: Leaving directory '/home/testlab/trunk'
package/Makefile:188: recipe for target '/home/testlab/trunk/staging_dir/target-mips_34kc_musl-1.1.10/stamp/.package_compile' failed
make[1]: *** [/home/testlab/trunk/staging_dir/target-mips_34kc_musl-1.1.10/stamp/.package_compile] Error 2
make[1]: Leaving directory '/home/testlab/trunk'
/home/testlab/trunk/include/toplevel.mk:181: recipe for target 'world' failed
make: *** [world] Error 2

Fail on newest trunk r46147. If I deselect mtr, everything ok.

Attachments (0)

Change History (1)

comment:1 Changed 3 years ago by swalker

  • Resolution set to moved_to_github
  • Status changed from new to closed

mtr is maintained here: ​https://github.com/openwrt/packages

Add Comment

Modify Ticket

Action
as closed .
The resolution will be deleted. Next status will be 'reopened'.
Author


E-mail address and user name can be saved in the Preferences.

 
Note: See TracTickets for help on using tickets.