Modify

Opened 11 years ago

Closed 11 years ago

#1872 closed defect (worksforme)

kismet fails to compile on kamikaze 7.06

Reported by: anonymous Owned by: florian
Priority: normal Milestone: Kamikaze 7.06
Component: packages Version:
Keywords: kismet kamikaze compile Cc:

Description

This may be more than the necessary text, but...:

cursesfront.cc: In member function `virtual int NCurseFront::InitDisplay(int, time_t)':
cursesfront.cc:46: error: `initscr' was not declared in this scope
cursesfront.cc:48: error: `stdscr' was not declared in this scope
cursesfront.cc:48: error: `LINES' was not declared in this scope
cursesfront.cc:48: error: `COLS' was not declared in this scope
cursesfront.cc:48: error: `subwin' was not declared in this scope
cursesfront.cc:60: error: `scrollok' was not declared in this scope
cursesfront.cc:46: warning: unused variable 'initscr'
cursesfront.cc:60: warning: unused variable 'scrollok'
cursesfront.cc: In member function `virtual int NCurseFront::WriteStatus(std::string)':
cursesfront.cc:69: error: `winsertln' was not declared in this scope
cursesfront.cc:70: error: `COLS' was not declared in this scope
cursesfront.cc:70: error: `mvwaddstr' was not declared in this scope
cursesfront.cc:69: warning: unused variable 'winsertln'
cursesfront.cc:70: warning: unused variable 'COLS'
cursesfront.cc:70: warning: unused variable 'mvwaddstr'
cursesfront.cc: In member function `virtual int NCurseFront::DrawDisplay()':
cursesfront.cc:81: error: `box' was not declared in this scope
cursesfront.cc:82: error: `mvwaddstr' was not declared in this scope
cursesfront.cc:83: error: `COLS' was not declared in this scope
cursesfront.cc:83: warning: unused variable 'COLS'
cursesfront.cc:113: error: `LINES' was not declared in this scope
cursesfront.cc:113: warning: unused variable 'LINES'
cursesfront.cc:120: error: `LINES' was not declared in this scope
cursesfront.cc:120: error: `mvwaddch' was not declared in this scope
cursesfront.cc:129: error: `werase' was not declared in this scope
cursesfront.cc:184: error: `COLS' was not declared in this scope
cursesfront.cc:184: warning: unused variable 'COLS'
cursesfront.cc:213: error: `COLS' was not declared in this scope
cursesfront.cc:213: warning: unused variable 'COLS'
cursesfront.cc:237: error: `COLS' was not declared in this scope
cursesfront.cc:237: warning: unused variable 'COLS'
cursesfront.cc:268: error: `wrefresh' was not declared in this scope
cursesfront.cc:274: error: `refresh' was not declared in this scope
cursesfront.cc:274: warning: unused variable 'refresh'
cursesfront.cc: In member function `virtual int NCurseFront::EndDisplay()':
cursesfront.cc:282: error: `endwin' was not declared in this scope
cursesfront.cc:282: warning: unused variable 'endwin'
/home/descartes/Desktop/kamikaze_7.06/staging_dir_mipsel/lib/gcc/mipsel-linux-uclibc/3.4.6/../../../../mipsel-linux-uclibc/sys-include/string: At global scope:
/home/descartes/Desktop/kamikaze_7.06/staging_dir_mipsel/lib/gcc/mipsel-linux-uclibc/3.4.6/../../../../mipsel-linux-uclibc/sys-include/string:100: warning: inline function `std::basic_string<Ch, Tr, A>::~basic_string() [with Ch = char, Tr = std::char_traits<char>, A = std::allocator<char>]' used but never defined
/home/descartes/Desktop/kamikaze_7.06/staging_dir_mipsel/lib/gcc/mipsel-linux-uclibc/3.4.6/../../../../mipsel-linux-uclibc/sys-include/string:71: warning: inline function `std::basic_string<Ch, Tr, A>::basic_string(const A&) [with Ch = char, Tr = std::char_traits<char>, A = std::allocator<char>]' used but never defined
make[4]: * [cursesfront.o] Error 1
make[4]: Leaving directory `/home/descartes/Desktop/kamikaze_7.06/build_mipsel/kismet-2007-01-R1a'
make[3]:
* /home/descartes/Desktop/kamikaze_7.06/build_mipsel/kismet-2007-01-R1a/.built Error 2
make[3]: Leaving directory `/home/descartes/Desktop/kamikaze_7.06/feeds/https_svn.openwrt.org_openwrt_packages_/net/kismet'
make[2]: * [kismet-compile] Error 2
make[2]: Leaving directory `/home/descartes/Desktop/kamikaze_7.06/package'
make[1]:
* [package/compile] Error 2
make[1]: Leaving directory `/home/descartes/Desktop/kamikaze_7.06'
make: * [world] Error 2

Attachments (0)

Change History (2)

comment:1 Changed 11 years ago by florian

  • Owner changed from developers to florian
  • Status changed from new to assigned

comment:2 Changed 11 years ago by florian

  • Resolution set to worksforme
  • Status changed from assigned to closed

You might be missing the uclibc++ dependency, it compiles fine here with kamikaze 7.06.

Add Comment

Modify Ticket

Action
as closed .
The resolution will be deleted. Next status will be 'reopened'.
Author


E-mail address and user name can be saved in the Preferences.

 
Note: See TracTickets for help on using tickets.