Modify

Opened 3 years ago

Closed 3 years ago

#17893 closed defect (fixed)

openvswitch compilation error

Reported by: anonymous Owned by: developers
Priority: normal Milestone: Chaos Calmer 15.05
Component: packages Version: Trunk
Keywords: openvswitch x86 Cc: ardeleanalex@…

Description

cp -fpR /home/development/src/openwrt-trunk/openwrt/build_dir/target-i386_i486_uClibc-0.9.33.2/openvswitch-2.3.0/lib/.libs/libopenvswitch-2.3.0.so  /home/development/src/openwrt-trunk/openwrt/staging_dir/target-i386_i486_uClibc-0.9.33.2/root-x86/tmp-openvswitch-common/usr/lib/
cp -fpR /home/development/src/openwrt-trunk/openwrt/build_dir/target-i386_i486_uClibc-0.9.33.2/openvswitch-2.3.0/ofproto/.libs/libofproto-2.3.0.so  /home/development/src/openwrt-trunk/openwrt/staging_dir/target-i386_i486_uClibc-0.9.33.2/root-x86/tmp-openvswitch-common/usr/lib/
cp -fpR /home/development/src/openwrt-trunk/openwrt/build_dir/target-i386_i486_uClibc-0.9.33.2/openvswitch-2.3.0/ovsdb/.libs/libovsdb-2.3.0.so  /home/development/src/openwrt-trunk/openwrt/staging_dir/target-i386_i486_uClibc-0.9.33.2/root-x86/tmp-openvswitch-common/usr/lib/
install -d -m0755 /home/development/src/openwrt-trunk/openwrt/staging_dir/target-i386_i486_uClibc-0.9.33.2/root-x86/tmp-openvswitch-common/usr/bin/
install -m0755 /home/development/src/openwrt-trunk/openwrt/build_dir/target-i386_i486_uClibc-0.9.33.2/openvswitch-2.3.0/utilities/.libs/ovs-appctl /home/development/src/openwrt-trunk/openwrt/staging_dir/target-i386_i486_uClibc-0.9.33.2/root-x86/tmp-openvswitch-common/usr/bin/
install -m0755 /home/development/src/openwrt-trunk/openwrt/build_dir/target-i386_i486_uClibc-0.9.33.2/openvswitch-2.3.0/utilities/.libs/ovs-ofctl /home/development/src/openwrt-trunk/openwrt/staging_dir/target-i386_i486_uClibc-0.9.33.2/root-x86/tmp-openvswitch-common/usr/bin/
install -m0755 /home/development/src/openwrt-trunk/openwrt/build_dir/target-i386_i486_uClibc-0.9.33.2/openvswitch-2.3.0/ovsdb/.libs/ovsdb-client /home/development/src/openwrt-trunk/openwrt/staging_dir/target-i386_i486_uClibc-0.9.33.2/root-x86/tmp-openvswitch-common/usr/bin/
SHELL= /home/development/src/openwrt-trunk/openwrt/staging_dir/host/bin/flock /home/development/src/openwrt-trunk/openwrt/tmp/.root-copy.flock -c 'cp -fpR /home/development/src/openwrt-trunk/openwrt/staging_dir/target-i386_i486_uClibc-0.9.33.2/root-x86/tmp-openvswitch-common/. /home/development/src/openwrt-trunk/openwrt/staging_dir/target-i386_i486_uClibc-0.9.33.2/root-x86/'
rm -rf /home/development/src/openwrt-trunk/openwrt/staging_dir/target-i386_i486_uClibc-0.9.33.2/root-x86/tmp-openvswitch-common
touch /home/development/src/openwrt-trunk/openwrt/staging_dir/target-i386_i486_uClibc-0.9.33.2/root-x86/stamp/.openvswitch-common_installed
mkdir -p /home/development/src/openwrt-trunk/openwrt/bin/x86/packages /home/development/src/openwrt-trunk/openwrt/build_dir/target-i386_i486_uClibc-0.9.33.2/openvswitch-2.3.0/ipkg-x86/openvswitch-controller/CONTROL /home/development/src/openwrt-trunk/openwrt/staging_dir/target-i386_i486_uClibc-0.9.33.2/pkginfo
install -d -m0755 /home/development/src/openwrt-trunk/openwrt/build_dir/target-i386_i486_uClibc-0.9.33.2/openvswitch-2.3.0/ipkg-x86/openvswitch-controller/usr/bin/
install -m0755 /home/development/src/openwrt-trunk/openwrt/build_dir/target-i386_i486_uClibc-0.9.33.2/openvswitch-2.3.0/utilities/.libs/ovs-controller /home/development/src/openwrt-trunk/openwrt/build_dir/target-i386_i486_uClibc-0.9.33.2/openvswitch-2.3.0/ipkg-x86/openvswitch-controller/usr/bin/
install: cannot stat `/home/development/src/openwrt-trunk/openwrt/build_dir/target-i386_i486_uClibc-0.9.33.2/openvswitch-2.3.0/utilities/.libs/ovs-controller': No such file or directory
make[3]: *** [/home/development/src/openwrt-trunk/openwrt/bin/x86/packages/packages/openvswitch-controller_2.3.0-2b70c4b929d18d1f36dcdeb71ea5c383cbb662e9_x86.ipk] Error 1
make[3]: Leaving directory `/home/development/src/openwrt-trunk/openwrt/feeds/packages/net/openvswitch'
make[2]: *** [package/feeds/packages/openvswitch/compile] Error 2
make[2]: Leaving directory `/home/development/src/openwrt-trunk/openwrt'
make[1]: *** [/home/development/src/openwrt-trunk/openwrt/staging_dir/target-i386_i486_uClibc-0.9.33.2/stamp/.package_compile] Error 2
make[1]: Leaving directory `/home/development/src/openwrt-trunk/openwrt'
make: *** [world] Error 2

Attachments (0)

Change History (4)

comment:1 Changed 3 years ago by ardeleanalex@…

On it; will come back with some findings asap.

comment:2 Changed 3 years ago by ardeleanalex@…

Updated feed.
https://github.com/openwrt/packages/pull/320


According to the NEWS message from the main OVS site:
http://openvswitch.org/releases/NEWS-2.3.0

Excerpt:

ovs-controller has been renamed test-controller. It is no longer packaged or installed by default, because too many users assumed incorrectly that ovs-controller was a necessary or desirable part of an Open vSwitch deployment.

Current feed was updated based on a feed that packaged OVS 1.9,
and subsequently updated.

For now, we'll remove it, since it's not required.
When I tested the feed, I tested it on a setup that has been configured
some time ago, and does not have that package enabled.

So, I'll remove it to prevent confusion.


comment:3 Changed 3 years ago by ardeleanalex@…

I'll probably start doing a cleanup in the next couple of days.
I'll check to see what modules get used and what's stale from OVS 1.9 up to version 2.3

comment:4 Changed 3 years ago by cyrus

  • Resolution set to fixed
  • Status changed from new to closed

Add Comment

Modify Ticket

Action
as closed .
The resolution will be deleted. Next status will be 'reopened'.
Author


E-mail address and user name can be saved in the Preferences.

 
Note: See TracTickets for help on using tickets.