Modify

Opened 4 years ago

Closed 4 years ago

#14011 closed defect (fixed)

ruby build problem in current trunk

Reported by: anonymous Owned by: developers
Priority: normal Milestone: Chaos Calmer 15.05
Component: packages Version: Trunk
Keywords: Cc:

Description

make[5]: Entering directory `/home/jo/openwrt/trunk/build_dir/target-mips_r2_uClibc-0.9.33.2/ruby-1.9.2-p0/ext/mathn/rational'
make[5]: Nothing to be done for `all'.
make[5]: Leaving directory `/home/jo/openwrt/trunk/build_dir/target-mips_r2_uClibc-0.9.33.2/ruby-1.9.2-p0/ext/mathn/rational'
compiling nkf
make[5]: Entering directory `/home/jo/openwrt/trunk/build_dir/target-mips_r2_uClibc-0.9.33.2/ruby-1.9.2-p0/ext/nkf'
make[5]: Nothing to be done for `all'.
make[5]: Leaving directory `/home/jo/openwrt/trunk/build_dir/target-mips_r2_uClibc-0.9.33.2/ruby-1.9.2-p0/ext/nkf'
compiling objspace
make[5]: Entering directory `/home/jo/openwrt/trunk/build_dir/target-mips_r2_uClibc-0.9.33.2/ruby-1.9.2-p0/ext/objspace'
make[5]: Nothing to be done for `all'.
make[5]: Leaving directory `/home/jo/openwrt/trunk/build_dir/target-mips_r2_uClibc-0.9.33.2/ruby-1.9.2-p0/ext/objspace'
compiling openssl
make[5]: Entering directory `/home/jo/openwrt/trunk/build_dir/target-mips_r2_uClibc-0.9.33.2/ruby-1.9.2-p0/ext/openssl'
mips-openwrt-linux-uclibc-gcc -I. -I../../.ext/include/mips-linux -I../.././include -I../.././ext/openssl -DRUBY_EXTCONF_H=\"extconf.h\" -I/home/jo/openwrt/trunk/staging_dir/target-mips_r2_uClibc-0.9.33.2/usr/include -I/home/jo/openwrt/trunk/staging_dir/target-mips_r2_uClibc-0.9.33.2/include -I/home/jo/openwrt/trunk/staging_dir/toolchain-mips_r2_gcc-4.6-linaro_uClibc-0.9.33.2/usr/include -I/home/jo/openwrt/trunk/staging_dir/toolchain-mips_r2_gcc-4.6-linaro_uClibc-0.9.33.2/include -I/home/jo/openwrt/trunk/staging_dir/target-mips_r2_uClibc-0.9.33.2/usr/lib/libiconv-stub/include -I/home/jo/openwrt/trunk/staging_dir/target-mips_r2_uClibc-0.9.33.2/usr/lib/libintl-stub/include  -D_FILE_OFFSET_BITS=64  -fPIC -Os -pipe -mips32r2 -mtune=34kc -mno-branch-likely -fno-caller-saves -fhonour-copts -Wno-error=unused-but-set-variable -msoft-float -I/home/jo/openwrt/trunk/staging_dir/target-mips_r2_uClibc-0.9.33.2/usr/lib/libiconv-stub/include -I/home/jo/openwrt/trunk/staging_dir/target-mips_r2_uClibc-0.9.33.2/usr/lib/libintl-stub/include  -fPIC  -o ossl_pkey_ec.o -c ossl_pkey_ec.c
ossl_pkey_ec.c: In function 'ossl_ec_group_initialize':
ossl_pkey_ec.c:761:24: warning: assignment makes pointer from integer without a cast [enabled by default]
ossl_pkey_ec.c:815:29: error: 'EC_GROUP_new_curve_GF2m' undeclared (first use in this function)
ossl_pkey_ec.c:815:29: note: each undeclared identifier is reported only once for each function it appears in
make[5]: *** [ossl_pkey_ec.o] Error 1
make[5]: Leaving directory `/home/jo/openwrt/trunk/build_dir/target-mips_r2_uClibc-0.9.33.2/ruby-1.9.2-p0/ext/openssl'
make[4]: *** [mkmain.sh] Error 1
make[4]: Leaving directory `/home/jo/openwrt/trunk/build_dir/target-mips_r2_uClibc-0.9.33.2/ruby-1.9.2-p0'
make[3]: *** [/home/jo/openwrt/trunk/build_dir/target-mips_r2_uClibc-0.9.33.2/ruby-1.9.2-p0/.built] Error 2
make[3]: Leaving directory `/home/jo/openwrt/trunk/feeds/packages/lang/ruby'
make[2]: *** [package/feeds/packages/ruby/compile] Error 2
make[2]: Leaving directory `/home/jo/openwrt/trunk'
make[1]: *** [/home/jo/openwrt/trunk/staging_dir/target-mips_r2_uClibc-0.9.33.2/stamp/.package_compile] Error 2
make[1]: Leaving directory `/home/jo/openwrt/trunk'
make: *** [world] Error 2

Attachments (0)

Change History (2)

comment:1 Changed 4 years ago by Shogo

Confirm that Trunk 37950 has the same issue

comment:2 Changed 4 years ago by hauke

  • Resolution set to fixed
  • Status changed from new to closed

This was fixed in r39542.

Add Comment

Modify Ticket

Action
as closed .
The resolution will be deleted. Next status will be 'reopened'.
Author


E-mail address and user name can be saved in the Preferences.

 
Note: See TracTickets for help on using tickets.