Modify

Opened 5 years ago

Closed 5 years ago

#13720 closed defect (fixed)

compat-wireless-2013-06-13 bug

Reported by: fclql@… Owned by: developers
Priority: highest Milestone: Chaos Calmer 15.05
Component: kernel Version: Trunk
Keywords: Cc:

Description

make[4]: Entering directory `/home/openwrt/trunk/build_dir/target-mipsel_dsp_uClibc-0.9.33.2/linux-ramips_rt305x/compat-wireless-2013-06-13'
make[5]: `Kconfig.versions' is up to date.
make[7]: `Kconfig.versions' is up to date.
make[8]: `conf' is up to date.
#
# configuration written to .config
#
Building backport-include/backport/autoconf.h ... done.
  CC [M]  /home/openwrt/trunk/build_dir/target-mipsel_dsp_uClibc-0.9.33.2/linux-ramips_rt305x/compat-wireless-2013-06-13/compat/main.o
Assembler messages:
Warning: A different -march was already specified, is now mips32r2
  CC [M]  /home/openwrt/trunk/build_dir/target-mipsel_dsp_uClibc-0.9.33.2/linux-ramips_rt305x/compat-wireless-2013-06-13/compat/compat-3.9.o
Assembler messages:
Warning: A different -march was already specified, is now mips32r2
  CC [M]  /home/openwrt/trunk/build_dir/target-mipsel_dsp_uClibc-0.9.33.2/linux-ramips_rt305x/compat-wireless-2013-06-13/compat/backport-3.10.o
Assembler messages:
Warning: A different -march was already specified, is now mips32r2
  LD [M]  /home/openwrt/trunk/build_dir/target-mipsel_dsp_uClibc-0.9.33.2/linux-ramips_rt305x/compat-wireless-2013-06-13/compat/compat.o
  CC [M]  /home/openwrt/trunk/build_dir/target-mipsel_dsp_uClibc-0.9.33.2/linux-ramips_rt305x/compat-wireless-2013-06-13/drivers/net/wireless/rt2x00/rt2x00dev.o
Assembler messages:
Warning: A different -march was already specified, is now mips32r2
  CC [M]  /home/openwrt/trunk/build_dir/target-mipsel_dsp_uClibc-0.9.33.2/linux-ramips_rt305x/compat-wireless-2013-06-13/drivers/net/wireless/rt2x00/rt2x00mac.o
Assembler messages:
Warning: A different -march was already specified, is now mips32r2
  CC [M]  /home/openwrt/trunk/build_dir/target-mipsel_dsp_uClibc-0.9.33.2/linux-ramips_rt305x/compat-wireless-2013-06-13/drivers/net/wireless/rt2x00/rt2x00config.o
Assembler messages:
Warning: A different -march was already specified, is now mips32r2
  CC [M]  /home/openwrt/trunk/build_dir/target-mipsel_dsp_uClibc-0.9.33.2/linux-ramips_rt305x/compat-wireless-2013-06-13/drivers/net/wireless/rt2x00/rt2x00queue.o
Assembler messages:
Warning: A different -march was already specified, is now mips32r2
  CC [M]  /home/openwrt/trunk/build_dir/target-mipsel_dsp_uClibc-0.9.33.2/linux-ramips_rt305x/compat-wireless-2013-06-13/drivers/net/wireless/rt2x00/rt2x00link.o
Assembler messages:
Warning: A different -march was already specified, is now mips32r2
  CC [M]  /home/openwrt/trunk/build_dir/target-mipsel_dsp_uClibc-0.9.33.2/linux-ramips_rt305x/compat-wireless-2013-06-13/drivers/net/wireless/rt2x00/rt2x00crypto.o
Assembler messages:
Warning: A different -march was already specified, is now mips32r2
  CC [M]  /home/openwrt/trunk/build_dir/target-mipsel_dsp_uClibc-0.9.33.2/linux-ramips_rt305x/compat-wireless-2013-06-13/drivers/net/wireless/rt2x00/rt2x00firmware.o
Assembler messages:
Warning: A different -march was already specified, is now mips32r2
  CC [M]  /home/openwrt/trunk/build_dir/target-mipsel_dsp_uClibc-0.9.33.2/linux-ramips_rt305x/compat-wireless-2013-06-13/drivers/net/wireless/rt2x00/rt2x00leds.o
Assembler messages:
Warning: A different -march was already specified, is now mips32r2
  CC [M]  /home/openwrt/trunk/build_dir/target-mipsel_dsp_uClibc-0.9.33.2/linux-ramips_rt305x/compat-wireless-2013-06-13/drivers/net/wireless/rt2x00/rt2x00eeprom.o
Assembler messages:
Warning: A different -march was already specified, is now mips32r2
/home/openwrt/trunk/build_dir/target-mipsel_dsp_uClibc-0.9.33.2/linux-ramips_rt305x/compat-wireless-2013-06-13/drivers/net/wireless/rt2x00/rt2x00eeprom.c: In function 'rt2800pci_read_eeprom_mtd':
/home/openwrt/trunk/build_dir/target-mipsel_dsp_uClibc-0.9.33.2/linux-ramips_rt305x/compat-wireless-2013-06-13/drivers/net/wireless/rt2x00/rt2x00eeprom.c:83:15: warning: assignment from incompatible pointer type [enabled by default]
   mtd_fw.data = rt2x00dev->eeprom;
               ^
  LD [M]  /home/openwrt/trunk/build_dir/target-mipsel_dsp_uClibc-0.9.33.2/linux-ramips_rt305x/compat-wireless-2013-06-13/drivers/net/wireless/rt2x00/rt2x00lib.o
  CC [M]  /home/openwrt/trunk/build_dir/target-mipsel_dsp_uClibc-0.9.33.2/linux-ramips_rt305x/compat-wireless-2013-06-13/drivers/net/wireless/rt2x00/rt2x00mmio.o
Assembler messages:
Warning: A different -march was already specified, is now mips32r2
  CC [M]  /home/openwrt/trunk/build_dir/target-mipsel_dsp_uClibc-0.9.33.2/linux-ramips_rt305x/compat-wireless-2013-06-13/drivers/net/wireless/rt2x00/rt2x00pci.o
Assembler messages:
Warning: A different -march was already specified, is now mips32r2
/home/openwrt/trunk/build_dir/target-mipsel_dsp_uClibc-0.9.33.2/linux-ramips_rt305x/compat-wireless-2013-06-13/drivers/net/wireless/rt2x00/rt2x00pci.c: In function 'rt2x00pci_probe':
/home/openwrt/trunk/build_dir/target-mipsel_dsp_uClibc-0.9.33.2/linux-ramips_rt305x/compat-wireless-2013-06-13/drivers/net/wireless/rt2x00/rt2x00pci.c:111:2: error: implicit declaration of function 'pci_enable_msi' [-Werror=implicit-function-declaration]
  pci_enable_msi(pci_dev);
  ^
/home/openwrt/trunk/build_dir/target-mipsel_dsp_uClibc-0.9.33.2/linux-ramips_rt305x/compat-wireless-2013-06-13/drivers/net/wireless/rt2x00/rt2x00pci.c:165:2: error: implicit declaration of function 'pci_disable_msi' [-Werror=implicit-function-declaration]
  pci_disable_msi(pci_dev);
  ^
cc1: some warnings being treated as errors
make[10]: *** [/home/openwrt/trunk/build_dir/target-mipsel_dsp_uClibc-0.9.33.2/linux-ramips_rt305x/compat-wireless-2013-06-13/drivers/net/wireless/rt2x00/rt2x00pci.o] Error 1
make[9]: *** [/home/openwrt/trunk/build_dir/target-mipsel_dsp_uClibc-0.9.33.2/linux-ramips_rt305x/compat-wireless-2013-06-13/drivers/net/wireless/rt2x00] Error 2
make[8]: *** [/home/openwrt/trunk/build_dir/target-mipsel_dsp_uClibc-0.9.33.2/linux-ramips_rt305x/compat-wireless-2013-06-13/drivers/net/wireless] Error 2
make[7]: *** [_module_/home/openwrt/trunk/build_dir/target-mipsel_dsp_uClibc-0.9.33.2/linux-ramips_rt305x/compat-wireless-2013-06-13] Error 2
make[6]: *** [modules] Error 2
make[5]: *** [modules] Error 2
make[4]: *** [modules] Error 2
make[4]: Leaving directory `/home/openwrt/trunk/build_dir/target-mipsel_dsp_uClibc-0.9.33.2/linux-ramips_rt305x/compat-wireless-2013-06-13'
make[3]: *** [/home/openwrt/trunk/build_dir/target-mipsel_dsp_uClibc-0.9.33.2/linux-ramips_rt305x/compat-wireless-2013-06-13/.built] Error 2
make[3]: Leaving directory `/home/openwrt/h2ofan/package/mac80211'
make[2]: *** [package/mac80211/compile] Error 2
make[2]: Leaving directory `/home/openwrt/trunk'
make[1]: *** [/home/openwrt/trunk/staging_dir/target-mipsel_dsp_uClibc-0.9.33.2/stamp/.package_compile] Error 2
make[1]: Leaving directory `/home/openwrt/trunk

Attachments (0)

Change History (1)

comment:1 Changed 5 years ago by hauke

  • Resolution set to fixed
  • Status changed from new to closed

This was fixed in r36972.

Add Comment

Modify Ticket

Action
as closed .
The resolution will be deleted. Next status will be 'reopened'.
Author


E-mail address and user name can be saved in the Preferences.

 
Note: See TracTickets for help on using tickets.