Opened 5 years ago

#13440 new defect

MAC OS x 10.8.3 compile Trunk error

Reported by: sniperpr@… Owned by: developers
Priority: normal Milestone: Chaos Calmer 15.05
Component: base system Version: Trunk
Keywords: Cc:


ypes.hh Partially_Reduced_Product.defs.hh Partially_Reduced_Product.inlines.hh Partially_Reduced_Product.templates.hh max_space_dimension.hh algorithms.hh wrap.hh ) || echo "$i" ; \
	done > ppl_include_files.hh
../utils/build_header \
		-I .. -I ../src \
		../src/ppl_header.hh >ppl.hh
../utils/text2cxxarray --name=BUGS_array \
		../BUGS >
../utils/text2cxxarray --name=COPYING_array \
		../COPYING >
../utils/text2cxxarray --name=CREDITS_array \
		../CREDITS >
make  all-am
/bin/bash ../libtool --tag=CXX   --mode=compile g++ -DHAVE_CONFIG_H -I. -I..  -I.. -I../src  -I/Volumes/Data/openwrt/trunk/staging_dir/host/include  -g -O2 -frounding-math  -W -Wall -MT Box.lo -MD -MP -MF .deps/Box.Tpo -c -o Box.lo
OpenWrt-libtool: compile:  g++ -DHAVE_CONFIG_H -I. -I.. -I.. -I../src -I/Volumes/Data/openwrt/trunk/staging_dir/host/include -g -O2 -frounding-math -W -Wall -MT Box.lo -MD -MP -MF .deps/Box.Tpo -c -o Box.o
In file included from checked.defs.hh:28:0,
                 from Checked_Number.defs.hh:27,
                 from Coefficient.types.hh:15,
                 from Coefficient.defs.hh:26,
                 from Box.defs.hh:28,
mp_std_bits.defs.hh:47:7: error: redefinition of 'class std::numeric_limits<__gmp_expr<__mpz_struct [1], __mpz_struct [1]> >'
/Volumes/Data/openwrt/trunk/staging_dir/host/include/gmpxx.h:3270:3: error: previous definition of 'class std::numeric_limits<__gmp_expr<__mpz_struct [1], __mpz_struct [1]> >'
mp_std_bits.defs.hh:108:7: error: redefinition of 'class std::numeric_limits<__gmp_expr<__mpq_struct [1], __mpq_struct [1]> >'
/Volumes/Data/openwrt/trunk/staging_dir/host/include/gmpxx.h:3307:3: error: previous definition of 'class std::numeric_limits<__gmp_expr<__mpq_struct [1], __mpq_struct [1]> >'
make[7]: *** [Box.lo] Error 1
make[6]: *** [all] Error 2
make[5]: *** [all-recursive] Error 1
make[4]: *** [all] Error 2
make[3]: *** [/Volumes/Data/openwrt/trunk/build_dir/host/ppl-0.10.2/.built] Error 2
make[3]: Leaving directory `/Volumes/Data/openwrt/trunk/tools/ppl'
make[2]: *** [tools/ppl/compile] Error 2
make[2]: Leaving directory `/Volumes/Data/openwrt/trunk'
make[1]: *** [/Volumes/Data/openwrt/trunk/staging_dir/target-arm_v7-a_uClibc-] Error 2
make[1]: Leaving directory `/Volumes/Data/openwrt/trunk'
make: *** [world] Error 2

Attachments (0)

Change History (0)

Add Comment

Modify Ticket

as new .

E-mail address and user name can be saved in the Preferences.

Note: See TracTickets for help on using tickets.