Opened 5 years ago

Closed 5 years ago

Last modified 4 years ago

#13212 closed defect (invalid)

compile error

Reported by: neryba Owned by: developers
Priority: normal Milestone: Barrier Breaker 14.07
Component: base system Version: Attitude Adjustment 12.09 Beta
Keywords: Cc:


from last AA 12.09 rc1.

Makefile:397: *** unterminated call to function `call': missing `)'.  Stop.
make[5]: *** [image-prereq] Error 2
make[4]: *** [prereq] Error 2
make[3]: *** [target/linux/prereq] Error 2
make[2]: *** [/home/ews/R300/staging_dir/target-mips_r2_uClibc-] Error 2
make[1]: *** [prereq] Error 2
make: *** [world] Error 2

Attachments (0)

Change History (4)

comment:1 Changed 5 years ago by florian

Can you please attach your .config file as well as mention if you have made any modifications to AA 12.09 rc1 sources? Also please mention which platform you are building for. Thanks!

comment:2 Changed 5 years ago by neryba

You can close the ticket. I downloaded repository again and all works now!

comment:3 Changed 5 years ago by jow

  • Resolution set to invalid
  • Status changed from new to closed

comment:4 Changed 4 years ago by jow

  • Milestone changed from Attitude Adjustment 12.09 to Barrier Breaker 14.07

Milestone Attitude Adjustment 12.09 deleted

Add Comment

Modify Ticket

as closed .
The resolution will be deleted. Next status will be 'reopened'.

E-mail address and user name can be saved in the Preferences.

Note: See TracTickets for help on using tickets.