Modify

Opened 11 years ago

Closed 11 years ago

Last modified 4 years ago

#1268 closed defect (fixed)

Busybox 1.4.0 compilation error

Reported by: blackcat Owned by: nico
Priority: highest Milestone: Barrier Breaker 14.07
Component: packages Version:
Keywords: busybox 1.4.0 Cc:

Description

Rebuilding /disks/hdb1/work/my.router/openwrt/kamikaze/bin/packages/busybox_1.4.0-1_mipsel.ipk
make[4]: Entering directory `/disks/hdb1/work/my.router/openwrt/kamikaze/package/busybox'
make -C /disks/hdb1/work/my.router/openwrt/kamikaze/build_mipsel/busybox-1.4.0 CC="mipsel-linux-uclibc-gcc" CROSS_COMPILE="mipsel-linux-uclibc-" EXTRA_CFLAGS="-Os -pipe -mips32 -mtune=mips32 -funit-at-a-time" ARCH="mipsel" IPKG_ARCH="mipsel" all
make[5]: Entering directory `/disks/hdb1/work/my.router/openwrt/kamikaze/build_mipsel/busybox-1.4.0'
  CC      networking/ip.o
In file included from networking/libiproute/libnetlink.h:5,
                 from networking/libiproute/utils.h:7,
                 from networking/ip.c:17:
/disks/hdb1/work/my.router/openwrt/kamikaze/staging_dir_mipsel/lib/gcc/mipsel-linux-uclibc/3.4.6/../../../../mipsel-linux-uclibc/sys-include/linux/netlink.h:22: error: syntax error before "__u32"
/disks/hdb1/work/my.router/openwrt/kamikaze/staging_dir_mipsel/lib/gcc/mipsel-linux-uclibc/3.4.6/../../../../mipsel-linux-uclibc/sys-include/linux/netlink.h:28: error: syntax error before "__u32"
/disks/hdb1/work/my.router/openwrt/kamikaze/staging_dir_mipsel/lib/gcc/mipsel-linux-uclibc/3.4.6/../../../../mipsel-linux-uclibc/sys-include/linux/netlink.h:30: error: syntax error before "nlmsg_flags"
/disks/hdb1/work/my.router/openwrt/kamikaze/staging_dir_mipsel/lib/gcc/mipsel-linux-uclibc/3.4.6/../../../../mipsel-linux-uclibc/sys-include/linux/netlink.h:31: error: syntax error before "nlmsg_seq"
/disks/hdb1/work/my.router/openwrt/kamikaze/staging_dir_mipsel/lib/gcc/mipsel-linux-uclibc/3.4.6/../../../../mipsel-linux-uclibc/sys-include/linux/netlink.h:32: error: syntax error before "nlmsg_pid"
/disks/hdb1/work/my.router/openwrt/kamikaze/staging_dir_mipsel/lib/gcc/mipsel-linux-uclibc/3.4.6/../../../../mipsel-linux-uclibc/sys-include/linux/netlink.h:83: error: field `msg' has incomplete type
In file included from networking/libiproute/libnetlink.h:6,
                 from networking/libiproute/utils.h:7,
                 from networking/ip.c:17:
/disks/hdb1/work/my.router/openwrt/kamikaze/staging_dir_mipsel/lib/gcc/mipsel-linux-uclibc/3.4.6/../../../../mipsel-linux-uclibc/sys-include/linux/rtnetlink.h:255: error: syntax error before "__u32"
/disks/hdb1/work/my.router/openwrt/kamikaze/staging_dir_mipsel/lib/gcc/mipsel-linux-uclibc/3.4.6/../../../../mipsel-linux-uclibc/sys-include/linux/rtnetlink.h:257: error: syntax error before "rta_expires"
/disks/hdb1/work/my.router/openwrt/kamikaze/staging_dir_mipsel/lib/gcc/mipsel-linux-uclibc/3.4.6/../../../../mipsel-linux-uclibc/sys-include/linux/rtnetlink.h:258: error: syntax error before "rta_error"
/disks/hdb1/work/my.router/openwrt/kamikaze/staging_dir_mipsel/lib/gcc/mipsel-linux-uclibc/3.4.6/../../../../mipsel-linux-uclibc/sys-include/linux/rtnetlink.h:259: error: syntax error before "rta_used"
/disks/hdb1/work/my.router/openwrt/kamikaze/staging_dir_mipsel/lib/gcc/mipsel-linux-uclibc/3.4.6/../../../../mipsel-linux-uclibc/sys-include/linux/rtnetlink.h:262: error: syntax error before "rta_id"
/disks/hdb1/work/my.router/openwrt/kamikaze/staging_dir_mipsel/lib/gcc/mipsel-linux-uclibc/3.4.6/../../../../mipsel-linux-uclibc/sys-include/linux/rtnetlink.h:263: error: syntax error before "rta_ts"
/disks/hdb1/work/my.router/openwrt/kamikaze/staging_dir_mipsel/lib/gcc/mipsel-linux-uclibc/3.4.6/../../../../mipsel-linux-uclibc/sys-include/linux/rtnetlink.h:264: error: syntax error before "rta_tsage"
/disks/hdb1/work/my.router/openwrt/kamikaze/staging_dir_mipsel/lib/gcc/mipsel-linux-uclibc/3.4.6/../../../../mipsel-linux-uclibc/sys-include/linux/rtnetlink.h:335: error: syntax error before "__s32"
/disks/hdb1/work/my.router/openwrt/kamikaze/staging_dir_mipsel/lib/gcc/mipsel-linux-uclibc/3.4.6/../../../../mipsel-linux-uclibc/sys-include/linux/rtnetlink.h:361: error: syntax error before "__u16"
/disks/hdb1/work/my.router/openwrt/kamikaze/staging_dir_mipsel/lib/gcc/mipsel-linux-uclibc/3.4.6/../../../../mipsel-linux-uclibc/sys-include/linux/rtnetlink.h:363: error: syntax error before "ndm_type"
/disks/hdb1/work/my.router/openwrt/kamikaze/staging_dir_mipsel/lib/gcc/mipsel-linux-uclibc/3.4.6/../../../../mipsel-linux-uclibc/sys-include/linux/rtnetlink.h:406: error: syntax error before "__u32"
/disks/hdb1/work/my.router/openwrt/kamikaze/staging_dir_mipsel/lib/gcc/mipsel-linux-uclibc/3.4.6/../../../../mipsel-linux-uclibc/sys-include/linux/rtnetlink.h:408: error: syntax error before "ndm_updated"
/disks/hdb1/work/my.router/openwrt/kamikaze/staging_dir_mipsel/lib/gcc/mipsel-linux-uclibc/3.4.6/../../../../mipsel-linux-uclibc/sys-include/linux/rtnetlink.h:409: error: syntax error before "ndm_refcnt"
/disks/hdb1/work/my.router/openwrt/kamikaze/staging_dir_mipsel/lib/gcc/mipsel-linux-uclibc/3.4.6/../../../../mipsel-linux-uclibc/sys-include/linux/rtnetlink.h:521: error: syntax error before "__u32"
/disks/hdb1/work/my.router/openwrt/kamikaze/staging_dir_mipsel/lib/gcc/mipsel-linux-uclibc/3.4.6/../../../../mipsel-linux-uclibc/sys-include/linux/rtnetlink.h:523: error: syntax error before "tcm_info"
In file included from networking/libiproute/utils.h:7,
                 from networking/ip.c:17:
networking/libiproute/libnetlink.h:11: error: field `local' has incomplete type
networking/libiproute/libnetlink.h:12: error: field `peer' has incomplete type
make[6]: *** [networking/ip.o] Error 1
make[5]: *** [networking] Error 2
make[5]: Leaving directory `/disks/hdb1/work/my.router/openwrt/kamikaze/build_mipsel/busybox-1.4.0'
make[4]: *** [/disks/hdb1/work/my.router/openwrt/kamikaze/build_mipsel/busybox-1.4.0/.built] Error 2
make[4]: Leaving directory `/disks/hdb1/work/my.router/openwrt/kamikaze/package/busybox'
make[3]: *** [busybox-compile] Error 2
make[3]: Leaving directory `/disks/hdb1/work/my.router/openwrt/kamikaze/package'
make[2]: *** [compile] Error 2
make[2]: Leaving directory `/disks/hdb1/work/my.router/openwrt/kamikaze/package'
make[1]: *** [package/compile] Error 2
make[1]: Leaving directory `/disks/hdb1/work/my.router/openwrt/kamikaze'
make: *** [world] Error 2

Attachments (0)

Change History (3)

comment:1 Changed 11 years ago by nico

  • Owner changed from developers to nico
  • Status changed from new to assigned

It looks like another linux-2.6.19 api change issue.

comment:2 Changed 11 years ago by nbd

  • Resolution set to fixed
  • Status changed from assigned to closed

Looks like it's fixed by [6261]

comment:3 Changed 4 years ago by jow

  • Milestone changed from Attitude Adjustment 12.09 to Barrier Breaker 14.07

Milestone Attitude Adjustment 12.09 deleted

Add Comment

Modify Ticket

Action
as closed .
The resolution will be deleted. Next status will be 'reopened'.
Author


E-mail address and user name can be saved in the Preferences.

 
Note: See TracTickets for help on using tickets.