Modify

Opened 6 years ago

Closed 6 years ago

Last modified 4 years ago

#11809 closed defect (fixed)

../zebra/rtadv.h:33:22: error: field 'prefix' has incomplete type

Reported by: anonymous Owned by: developers
Priority: normal Milestone: Barrier Breaker 14.07
Component: packages Version: Trunk
Keywords: Cc:

Description

Does anyone know why can it be ?

OpenWrt-libtool: link: (cd ".libs" && rm -f "libzebra.so.0" && ln -s "libzebra.so.0.0.0" "libzebra.so.0")
OpenWrt-libtool: link: (cd ".libs" && rm -f "libzebra.so" && ln -s "libzebra.so.0.0.0" "libzebra.so")
OpenWrt-libtool: link: ( cd ".libs" && rm -f "libzebra.la" && ln -s "../libzebra.la" "libzebra.la" )
make[6]: Leaving directory `/home/pavel/trunk/build_dir/target-mips_r2_uClibc-0.9.33.2/quagga-0.99.21/lib'
make[5]: Leaving directory `/home/pavel/trunk/build_dir/target-mips_r2_uClibc-0.9.33.2/quagga-0.99.21/lib'
Making all in zebra
make[5]: Entering directory `/home/pavel/trunk/build_dir/target-mips_r2_uClibc-0.9.33.2/quagga-0.99.21/zebra'
mips-openwrt-linux-uclibc-gcc -DHAVE_CONFIG_H -DSYSCONFDIR=\"/etc/quagga/\" -DMULTIPATH_NUM=8 -I. -I.. -I.. -I.. -I../lib   -I/home/pavel/trunk/staging_dir/target-mips_r2_uClibc-0.9.33.2/usr/include -I/home/pavel/trunk/staging_dir/target-mips_r2_uClibc-0.9.33.2/include -I/home/pavel/trunk/staging_dir/toolchain-mips_r2_gcc-4.6-linaro_uClibc-0.9.33.2/usr/include -I/home/pavel/trunk/staging_dir/toolchain-mips_r2_gcc-4.6-linaro_uClibc-0.9.33.2/include   -Os -pipe -mips32r2 -mtune=mips32r2 -fno-caller-saves -fhonour-copts -Wno-error=unused-but-set-variable -msoft-float -std=gnu99 -MT test_main.o -MD -MP -MF .deps/test_main.Tpo -c -o test_main.o test_main.c
mv -f .deps/test_main.Tpo .deps/test_main.Po
mips-openwrt-linux-uclibc-gcc -DHAVE_CONFIG_H -DSYSCONFDIR=\"/etc/quagga/\" -DMULTIPATH_NUM=8 -I. -I.. -I.. -I.. -I../lib   -I/home/pavel/trunk/staging_dir/target-mips_r2_uClibc-0.9.33.2/usr/include -I/home/pavel/trunk/staging_dir/target-mips_r2_uClibc-0.9.33.2/include -I/home/pavel/trunk/staging_dir/toolchain-mips_r2_gcc-4.6-linaro_uClibc-0.9.33.2/usr/include -I/home/pavel/trunk/staging_dir/toolchain-mips_r2_gcc-4.6-linaro_uClibc-0.9.33.2/include   -Os -pipe -mips32r2 -mtune=mips32r2 -fno-caller-saves -fhonour-copts -Wno-error=unused-but-set-variable -msoft-float -std=gnu99 -MT zebra_rib.o -MD -MP -MF .deps/zebra_rib.Tpo -c -o zebra_rib.o zebra_rib.c
mv -f .deps/zebra_rib.Tpo .deps/zebra_rib.Po
mips-openwrt-linux-uclibc-gcc -DHAVE_CONFIG_H -DSYSCONFDIR=\"/etc/quagga/\" -DMULTIPATH_NUM=8 -I. -I.. -I.. -I.. -I../lib   -I/home/pavel/trunk/staging_dir/target-mips_r2_uClibc-0.9.33.2/usr/include -I/home/pavel/trunk/staging_dir/target-mips_r2_uClibc-0.9.33.2/include -I/home/pavel/trunk/staging_dir/toolchain-mips_r2_gcc-4.6-linaro_uClibc-0.9.33.2/usr/include -I/home/pavel/trunk/staging_dir/toolchain-mips_r2_gcc-4.6-linaro_uClibc-0.9.33.2/include   -Os -pipe -mips32r2 -mtune=mips32r2 -fno-caller-saves -fhonour-copts -Wno-error=unused-but-set-variable -msoft-float -std=gnu99 -MT interface.o -MD -MP -MF .deps/interface.Tpo -c -o interface.o interface.c
In file included from interface.c:37:0:
../zebra/rtadv.h:33:22: error: field 'prefix' has incomplete type
make[5]: *** [interface.o] Error 1
make[5]: Leaving directory `/home/pavel/trunk/build_dir/target-mips_r2_uClibc-0.9.33.2/quagga-0.99.21/zebra'
make[4]: *** [all-recursive] Error 1
make[4]: Leaving directory `/home/pavel/trunk/build_dir/target-mips_r2_uClibc-0.9.33.2/quagga-0.99.21'
make[3]: *** [all] Error 2
make[3]: Leaving directory `/home/pavel/trunk/build_dir/target-mips_r2_uClibc-0.9.33.2/quagga-0.99.21'
make[2]: *** [/home/pavel/trunk/build_dir/target-mips_r2_uClibc-0.9.33.2/quagga-0.99.21/.built] Error 2
make[2]: Leaving directory `/home/pavel/trunk/feeds/packages/net/quagga'
make[1]: *** [package/feeds/packages/quagga/compile] Error 2
make[1]: Leaving directory `/home/pavel/trunk'
make: *** [package/quagga/compile] Error 2

Attachments (0)

Change History (4)

comment:1 follow-up: Changed 6 years ago by anonymous

It happened, when set this option to 'NO'

#
# Package build options
#
# CONFIG_DEBUG is not set
CONFIG_IPV6=y
# CONFIG_PKG_BUILD_PARALLEL is not set

#

comment:2 in reply to: ↑ 1 Changed 6 years ago by anonymous

Me same this problem.

Replying to anonymous:

It happened, when set this option to 'NO'

#
# Package build options
#
# CONFIG_DEBUG is not set
CONFIG_IPV6=y
# CONFIG_PKG_BUILD_PARALLEL is not set

#

this not helped !

comment:3 Changed 6 years ago by acinonyx

  • Resolution set to fixed
  • Status changed from new to closed

Should be fixed in r32697. Thanks for reporting!

comment:4 Changed 4 years ago by jow

  • Milestone changed from Attitude Adjustment 12.09 to Barrier Breaker 14.07

Milestone Attitude Adjustment 12.09 deleted

Add Comment

Modify Ticket

Action
as closed .
The resolution will be deleted. Next status will be 'reopened'.
Author


E-mail address and user name can be saved in the Preferences.

 
Note: See TracTickets for help on using tickets.