Modify

Opened 6 years ago

Closed 6 years ago

Last modified 4 years ago

#11590 closed defect (fixed)

error compiling latest trunk with luci asterisk module

Reported by: finas Owned by: developers
Priority: normal Milestone: Barrier Breaker 14.07
Component: packages Version: Trunk
Keywords: Cc:

Description

make V=s output:

make[5]: Entering directory `/home/finas/trunk/build_dir/target-mips_r2_uClibc-0.9.33.2/asterisk-1.8.10.1/channels'
mips-openwrt-linux-uclibc-gcc -o chan_lantiq.o -c chan_lantiq.c -MD -MT chan_lantiq.o -MF .chan_lantiq.o.d -MP -pthread -I/home/finas/trunk/build_dir/target-mips_r2_uClibc-0.9.33.2/asterisk-1.8.10.1/include -Ofast -pipe -mips32r2 -march=24kc -mtune=24kc -fno-caller-saves -fhonour-copts -Wno-error=unused-but-set-variable -msoft-float -I/home/finas/trunk/staging_dir/target-mips_r2_uClibc-0.9.33.2/usr/include -I/home/finas/trunk/staging_dir/target-mips_r2_uClibc-0.9.33.2/include -I/home/finas/trunk/staging_dir/toolchain-mips_r2_gcc-4.7-linaro_uClibc-0.9.33.2/usr/include -I/home/finas/trunk/staging_dir/toolchain-mips_r2_gcc-4.7-linaro_uClibc-0.9.33.2/include   -Wall -Wstrict-prototypes -Wmissing-prototypes -Wmissing-declarations    -fPIC -DAST_MODULE=\"chan_lantiq\"   -I/home/finas/trunk/staging_dir/target-mips_r2_uClibc-0.9.33.2/usr/include -I/home/finas/trunk/staging_dir/target-mips_r2_uClibc-0.9.33.2/include -I/home/finas/trunk/staging_dir/toolchain-mips_r2_gcc-4.7-linaro_uClibc-0.9.33.2/usr/include -I/home/finas/trunk/staging_dir/toolchain-mips_r2_gcc-4.7-linaro_uClibc-0.9.33.2/include -DLOW_MEMORY
chan_lantiq.c:73:34: fatal error: drv_tapi/drv_tapi_io.h: No such file or directory
compilation terminated.
make[5]: *** [chan_lantiq.o] Error 1
make[5]: Leaving directory `/home/finas/trunk/build_dir/target-mips_r2_uClibc-0.9.33.2/asterisk-1.8.10.1/channels'
make[4]: *** [channels] Error 2
make[4]: Leaving directory `/home/finas/trunk/build_dir/target-mips_r2_uClibc-0.9.33.2/asterisk-1.8.10.1'
make[3]: *** [/home/finas/trunk/build_dir/target-mips_r2_uClibc-0.9.33.2/asterisk-1.8.10.1/.built] Error 2
make[3]: Leaving directory `/home/finas/trunk/feeds/packages/net/asterisk-1.8.x'
make[2]: *** [package/feeds/packages/asterisk-1.8.x/compile] Error 2
make[2]: Leaving directory `/home/finas/trunk'
make[1]: *** [/home/finas/trunk/staging_dir/target-mips_r2_uClibc-0.9.33.2/stamp/.package_compile] Error 2
make[1]: Leaving directory `/home/finas/trunk'
make: *** [world] Error 2

problem appears to be related to /changeset/32047.html lantiq support as I was able to compile 32028 and the build fails on lantiq something

Attachments (0)

Change History (4)

comment:1 Changed 6 years ago by blogic

  • Resolution set to fixed
  • Status changed from new to closed

fixed in [32072]

comment:2 Changed 6 years ago by anonymous

  • Resolution fixed deleted
  • Status changed from closed to reopened

Now it fails with:

configure: error: The lib_ifxos include directory is not valid!
make[3]: *** [/path/to/trunk/build_dir/linux-ar71xx_generic/drv_tapi-3.13.0/.configured_] Error 1

comment:3 Changed 6 years ago by blogic

  • Resolution set to fixed
  • Status changed from reopened to closed

should be fixed now

comment:4 Changed 4 years ago by jow

  • Milestone changed from Attitude Adjustment 12.09 to Barrier Breaker 14.07

Milestone Attitude Adjustment 12.09 deleted

Add Comment

Modify Ticket

Action
as closed .
The resolution will be deleted. Next status will be 'reopened'.
Author


E-mail address and user name can be saved in the Preferences.

 
Note: See TracTickets for help on using tickets.