Modify

Opened 6 years ago

Closed 5 years ago

Last modified 4 years ago

#11055 closed defect (worksforme)

ruby package (1.9.2-p0) fail to install (missing ipkg-install/usr/bin/erb)

Reported by: Xavi <xleon@…> Owned by: developers
Priority: high Milestone: Barrier Breaker 14.07
Component: packages Version: Trunk
Keywords: ruby, erb Cc:

Description

when compiling ruby 1.9.2-p0 from scratch (rev 30750 of the package) it fails to create the ipkg package because the file /usr/bin/erb is not found.

Compiling for x86. The funny thing is that it just compiles fine on another host from scratch with the same openwrt configuration. Can you help me debug what's the missing piece?

WARNING: skipping ruby-enc -- package not selected
mkdir -p /usr/share/tomcat6/.jenkins/jobs/confine-test/workspace/confine-test/src/bin/x86/packages /usr/share/tomcat6/.jenkins/jobs/confine-test/workspace/confine-test/src/build_dir/target-i386_eglibc-2.13/ruby-1.9.2-p0/ipkg-x86/ruby-erb/CONTROL
install -d -m0755 /usr/share/tomcat6/.jenkins/jobs/confine-test/workspace/confine-test/src/build_dir/target-i386_eglibc-2.13/ruby-1.9.2-p0/ipkg-x86/ruby-erb/usr/bin
install -m0755 /usr/share/tomcat6/.jenkins/jobs/confine-test/workspace/confine-test/src/build_dir/target-i386_eglibc-2.13/ruby-1.9.2-p0/ipkg-install/usr/bin/erb /usr/share/tomcat6/.jenkins/jobs/confine-test/workspace/confine-test/src/build_dir/target-i386_eglibc-2.13/ruby-1.9.2-p0/ipkg-x86/ruby-erb/usr/bin/
install: cannot stat `/usr/share/tomcat6/.jenkins/jobs/confine-test/workspace/confine-test/src/build_dir/target-i386_eglibc-2.13/ruby-1.9.2-p0/ipkg-install/usr/bin/erb': No such file or directory
make[4]: *** [/usr/share/tomcat6/.jenkins/jobs/confine-test/workspace/confine-test/src/bin/x86/packages/ruby-erb_1.9.2-p0-1_x86.ipk] Error 1
make[4]: Leaving directory `/usr/share/tomcat6/.jenkins/jobs/confine-test/workspace/confine-test/packages/openwrt/lang/ruby'
make[3]: *** [package/feeds/openwrt/ruby/compile] Error 2
make[3]: Leaving directory `/usr/share/tomcat6/.jenkins/jobs/confine-test/workspace/confine-test/src'
make[2]: *** [/usr/share/tomcat6/.jenkins/jobs/confine-test/workspace/confine-test/src/staging_dir/target-i386_eglibc-2.13/stamp/.package_compile] Error 2
make[2]: Leaving directory `/usr/share/tomcat6/.jenkins/jobs/confine-test/workspace/confine-test/src'
make[1]: *** [world] Error 2
make[1]: Leaving directory `/usr/share/tomcat6/.jenkins/jobs/confine-test/workspace/confine-test/src'
make: *** [all] Error 2
Build step 'Execute shell' marked build as failure
Archiving artifacts
Finished: FAILURE

Attachments (0)

Change History (2)

comment:1 Changed 5 years ago by florian

  • Resolution set to worksforme
  • Status changed from new to closed

comment:2 Changed 4 years ago by jow

  • Milestone changed from Attitude Adjustment 12.09 to Barrier Breaker 14.07

Milestone Attitude Adjustment 12.09 deleted

Add Comment

Modify Ticket

Action
as closed .
The resolution will be deleted. Next status will be 'reopened'.
Author


E-mail address and user name can be saved in the Preferences.

 
Note: See TracTickets for help on using tickets.