Modify

Opened 6 years ago

Closed 6 years ago

Last modified 4 years ago

#10985 closed defect (fixed)

Build error R30576 with AR71xx and GCC 4.6.2

Reported by: anonymous Owned by: developers
Priority: normal Milestone: Barrier Breaker 14.07
Component: packages Version: Trunk
Keywords: Cc:

Description

Make log here. R30576 wigh GCC 4.6.2

mike@linux:~/openwrt/trunk$ svn up
At revision 30576.
mike@linux:~/openwrt/trunk$ make V=99
/home/mike/openwrt/trunk/target/linux/ar71xx/generic/profiles/d-link.mk:31: *** missing `endef', unterminated `define'.  Stop.
make[3]: *** [target/linux/prereq] Error 2
make[2]: *** [/home/mike/openwrt/trunk/staging_dir/target-mips_r2_uClibc-0.9.33/stamp/.target_prereq] Error 2
make[1]: *** [prereq] Error 2
make: *** [world] Error 2

Attachments (0)

Change History (2)

comment:1 Changed 6 years ago by juhosg

  • Resolution set to fixed
  • Status changed from new to closed

Fixed in r30577.

comment:2 Changed 4 years ago by jow

  • Milestone changed from Attitude Adjustment 12.09 to Barrier Breaker 14.07

Milestone Attitude Adjustment 12.09 deleted

Add Comment

Modify Ticket

Action
as closed .
The resolution will be deleted. Next status will be 'reopened'.
Author


E-mail address and user name can be saved in the Preferences.

 
Note: See TracTickets for help on using tickets.