Opened 6 years ago

Closed 6 years ago

Last modified 4 years ago

#10261 closed defect (fixed)

tcpdump fails to compile on backfire branch r28513

Reported by: ziesemer Owned by: developers
Priority: normal Milestone: Barrier Breaker 14.07
Component: packages Version: Backfire 10.03.1 RC5
Keywords: tcpdump compile fail Cc:


Having identical issues to what Etienne Champetier reported on :

./print-bt.c:40:28: error: pcap/bluetooth.h: No such file or directory
./print-bt.c: In function 'bt_if_print':
./print-bt.c:54: error: expected '=', ',', ';', 'asm' or 'attribute' before '*' token
./print-bt.c:54: error: 'hdr' undeclared (first use in this function)
./print-bt.c:54: error: (Each undeclared identifier is reported only once
./print-bt.c:54: error: for each function it appears in.)
./print-bt.c:54: error: expected ')' before 'pcap_bluetooth_h4_header'
./print-bt.c:56: error: 'pcap_bluetooth_h4_header' undeclared (first use in this function)
make[4]: * [print-bt.o] Error 1

Using Ubuntu 11.04:
Linux 2.6.38-11-generic #50-Ubuntu SMP Mon Sep 12 21:17:25 UTC 2011 x86_64 x86_64 x86_64 GNU/Linux

Attachments (0)

Change History (3)

comment:1 Changed 6 years ago by ziesemer

Per the same link above, this should now be marked as resolved.

comment:2 Changed 6 years ago by nbd

  • Resolution set to fixed
  • Status changed from new to closed

comment:3 Changed 4 years ago by jow

  • Milestone changed from Attitude Adjustment 12.09 to Barrier Breaker 14.07

Milestone Attitude Adjustment 12.09 deleted

Add Comment

Modify Ticket

as closed .
The resolution will be deleted. Next status will be 'reopened'.

E-mail address and user name can be saved in the Preferences.

Note: See TracTickets for help on using tickets.