Modify

Opened 6 years ago

Closed 6 years ago

Last modified 4 years ago

#10013 closed defect (fixed)

compilation error in trunk after change to 28093 (wireless-tools update)

Reported by: Martin G. <kommerz@…> Owned by: developers
Priority: normal Milestone: Barrier Breaker 14.07
Component: base system Version: Trunk
Keywords: wireless tools compilation error Cc:

Description

Compilation of 28093 (update to newest wireless tools) fails. Reverting to 28092 works and compiles well.

Here's the output:

make[4]: Entering directory `/home/mag81/openwrt/wndr3700v2/trunk/build_dir/linux-ar71xx_generic/compat-wireless-2011-08-26'
./scripts/gen-compat-autoconf.sh config.mk > include/linux/compat_autoconf.h
make -C /home/mag81/openwrt/wndr3700v2/trunk/build_dir/linux-ar71xx_generic/linux-2.6.39.4 M=/home/mag81/openwrt/wndr3700v2/trunk/build_dir/linux-ar71xx_generic/compat-wireless-2011-08-26 modules
make[5]: Entering directory `/home/mag81/openwrt/wndr3700v2/trunk/build_dir/linux-ar71xx_generic/linux-2.6.39.4'

CC [M] /home/mag81/openwrt/wndr3700v2/trunk/build_dir/linux-ar71xx_generic/compat-wireless-2011-08-26/compat/main.o
LD [M] /home/mag81/openwrt/wndr3700v2/trunk/build_dir/linux-ar71xx_generic/compat-wireless-2011-08-26/compat/compat.o
CC [M] /home/mag81/openwrt/wndr3700v2/trunk/build_dir/linux-ar71xx_generic/compat-wireless-2011-08-26/drivers/net/wireless/ath/main.o
CC [M] /home/mag81/openwrt/wndr3700v2/trunk/build_dir/linux-ar71xx_generic/compat-wireless-2011-08-26/drivers/net/wireless/ath/regd.o
CC [M] /home/mag81/openwrt/wndr3700v2/trunk/build_dir/linux-ar71xx_generic/compat-wireless-2011-08-26/drivers/net/wireless/ath/hw.o
CC [M] /home/mag81/openwrt/wndr3700v2/trunk/build_dir/linux-ar71xx_generic/compat-wireless-2011-08-26/drivers/net/wireless/ath/key.o
CC [M] /home/mag81/openwrt/wndr3700v2/trunk/build_dir/linux-ar71xx_generic/compat-wireless-2011-08-26/drivers/net/wireless/ath/debug.o

/home/mag81/openwrt/wndr3700v2/trunk/build_dir/linux-ar71xx_generic/compat-wireless-2011-08-26/drivers/net/wireless/ath/debug.c:19:13: error: redefinition of 'ath_opmode_to_string'
/home/mag81/openwrt/wndr3700v2/trunk/build_dir/linux-ar71xx_generic/compat-wireless-2011-08-26/drivers/net/wireless/ath/ath.h:283:27: note: previous definition of 'ath_opmode_to_string' was here
make[8]: * /home/mag81/openwrt/wndr3700v2/trunk/build_dir/linux-ar71xx_generic/compat-wireless-2011-08-26/drivers/net/wireless/ath/debug.o Error 1
make[7]:
* /home/mag81/openwrt/wndr3700v2/trunk/build_dir/linux-ar71xx_generic/compat-wireless-2011-08-26/drivers/net/wireless/ath Error 2
make[6]: * /home/mag81/openwrt/wndr3700v2/trunk/build_dir/linux-ar71xx_generic/compat-wireless-2011-08-26/drivers/net/wireless Error 2
make[5]:
* [_module_/home/mag81/openwrt/wndr3700v2/trunk/build_dir/linux-ar71xx_generic/compat-wireless-2011-08-26] Error 2
make[5]: Leaving directory `/home/mag81/openwrt/wndr3700v2/trunk/build_dir/linux-ar71xx_generic/linux-2.6.39.4'
make[4]: * [modules] Error 2
make[4]: Leaving directory `/home/mag81/openwrt/wndr3700v2/trunk/build_dir/linux-ar71xx_generic/compat-wireless-2011-08-26'
make[3]:
* /home/mag81/openwrt/wndr3700v2/trunk/build_dir/linux-ar71xx_generic/compat-wireless-2011-08-26/.built Error 2
make[3]: Leaving directory `/home/mag81/openwrt/wndr3700v2/trunk/package/mac80211'
make[2]: * [package/mac80211/compile] Error 2
make[2]: Leaving directory `/home/mag81/openwrt/wndr3700v2/trunk'
make[1]:
* /home/mag81/openwrt/wndr3700v2/trunk/staging_dir/target-mips_r2_uClibc-0.9.32/stamp/.package_compile Error 2
make[1]: Leaving directory `/home/mag81/openwrt/wndr3700v2/trunk'
make: * [world] Fehler 2

Attachments (0)

Change History (4)

comment:1 Changed 6 years ago by Martin G. <kommerz@…>

Sorry, forgot to mark it as code.

make[4]: Entering directory `/home/mag81/openwrt/wndr3700v2/trunk/build_dir/linux-ar71xx_generic/compat-wireless-2011-08-26' ./scripts/gen-compat-autoconf.sh config.mk > include/linux/compat_autoconf.h make -C /home/mag81/openwrt/wndr3700v2/trunk/build_dir/linux-ar71xx_generic/linux-2.6.39.4 M=/home/mag81/openwrt/wndr3700v2/trunk/build_dir/linux-ar71xx_generic/compat-wireless-2011-08-26 modules 
make[5]: Entering directory `/home/mag81/openwrt/wndr3700v2/trunk/build_dir/linux-ar71xx_generic/linux-2.6.39.4'

    CC [M] /home/mag81/openwrt/wndr3700v2/trunk/build_dir/linux-ar71xx_generic/compat-wireless-2011-08-26/compat/main.o LD [M] /home/mag81/openwrt/wndr3700v2/trunk/build_dir/linux-ar71xx_generic/compat-wireless-2011-08-26/compat/compat.o CC [M] /home/mag81/openwrt/wndr3700v2/trunk/build_dir/linux-ar71xx_generic/compat-wireless-2011-08-26/drivers/net/wireless/ath/main.o CC [M] /home/mag81/openwrt/wndr3700v2/trunk/build_dir/linux-ar71xx_generic/compat-wireless-2011-08-26/drivers/net/wireless/ath/regd.o CC [M] /home/mag81/openwrt/wndr3700v2/trunk/build_dir/linux-ar71xx_generic/compat-wireless-2011-08-26/drivers/net/wireless/ath/hw.o CC [M] /home/mag81/openwrt/wndr3700v2/trunk/build_dir/linux-ar71xx_generic/compat-wireless-2011-08-26/drivers/net/wireless/ath/key.o CC [M] /home/mag81/openwrt/wndr3700v2/trunk/build_dir/linux-ar71xx_generic/compat-wireless-2011-08-26/drivers/net/wireless/ath/debug.o

/home/mag81/openwrt/wndr3700v2/trunk/build_dir/linux-ar71xx_generic/compat-wireless-2011-08-26/drivers/net/wireless/ath/debug.c:19:13: error: redefinition of 'ath_opmode_to_string' /home/mag81/openwrt/wndr3700v2/trunk/build_dir/linux-ar71xx_generic/compat-wireless-2011-08-26/drivers/net/wireless/ath/ath.h:283:27: note: previous definition of 'ath_opmode_to_string' was here 
make[8]: *** /home/mag81/openwrt/wndr3700v2/trunk/build_dir/linux-ar71xx_generic/compat-wireless-2011-08-26/drivers/net/wireless/ath/debug.o Error 1 
make[7]: *** /home/mag81/openwrt/wndr3700v2/trunk/build_dir/linux-ar71xx_generic/compat-wireless-2011-08-26/drivers/net/wireless/ath Error 2 
make[6]: *** /home/mag81/openwrt/wndr3700v2/trunk/build_dir/linux-ar71xx_generic/compat-wireless-2011-08-26/drivers/net/wireless Error 2 
make[5]: *** [_module_/home/mag81/openwrt/wndr3700v2/trunk/build_dir/linux-ar71xx_generic/compat-wireless-2011-08-26] Error 2 
make[5]: Leaving directory `/home/mag81/openwrt/wndr3700v2/trunk/build_dir/linux-ar71xx_generic/linux-2.6.39.4' 
make[4]: *** [modules] Error 2 
make[4]: Leaving directory `/home/mag81/openwrt/wndr3700v2/trunk/build_dir/linux-ar71xx_generic/compat-wireless-2011-08-26' 
make[3]: *** /home/mag81/openwrt/wndr3700v2/trunk/build_dir/linux-ar71xx_generic/compat-wireless-2011-08-26/.built Error 2 
make[3]: Leaving directory `/home/mag81/openwrt/wndr3700v2/trunk/package/mac80211'
make[2]: *** [package/mac80211/compile] Error 2 
make[2]: Leaving directory `/home/mag81/openwrt/wndr3700v2/trunk' 
make[1]: *** /home/mag81/openwrt/wndr3700v2/trunk/staging_dir/target-mips_r2_uClibc-0.9.32/stamp/.package_compile Error 2 
make[1]: Leaving directory `/home/mag81/openwrt/wndr3700v2/trunk' make: *** [world] Fehler 2 

comment:2 Changed 6 years ago by nbd

  • Resolution set to fixed
  • Status changed from new to closed

fixed in r28095

comment:3 Changed 6 years ago by Martin Grosup <kommerz@…>

thanks a lot! :-)

comment:4 Changed 4 years ago by jow

  • Milestone changed from Attitude Adjustment 12.09 to Barrier Breaker 14.07

Milestone Attitude Adjustment 12.09 deleted

Add Comment

Modify Ticket

Action
as closed .
The resolution will be deleted. Next status will be 'reopened'.
Author


E-mail address and user name can be saved in the Preferences.

 
Note: See TracTickets for help on using tickets.