Ticket #8786: zlib-1.2.5-build_log.txt

File zlib-1.2.5-build_log.txt, 1.5 KB (added by Ch. Exner <c.exe@…>, 7 years ago)

Zlib 1.2.5 build log

Line 
1make[3]: Leaving directory `/build/geode/openwrt.svn/feeds/packages/net/etherwake'
2make[3]: Entering directory `/build/geode/openwrt.svn/package/zlib'
3make  -j6 -C /build/geode/openwrt.svn/build_dir/target-i486-openwrt-linux-gnu/zlib-1.2.5 AR=i486-openwrt-linux-gnu-ar AS="i486-openwrt-linux-gnu-gcc -c -O2 -pipe -march=geode
4-funit-at-a-time -mmmx -m3dnow" LD=i486-openwrt-linux-gnu-ld NM=i486-openwrt-linux-gnu-nm CC="i486-openwrt-linux-gnu-gcc" GCC="i486-openwrt-linux-gnu-gcc"
5CXX="i486-openwrt-linux-gnu-g++" RANLIB=i486-openwrt-linux-gnu-ranlib STRIP=i486-openwrt-linux-gnu-strip OBJCOPY=i486-openwrt-linux-gnu-objcopy OBJDUMP=i486-openwrt-linux-gnu-objdump
6SIZE=i486-openwrt-linux-gnu-size CFLAGS="-O2 -pipe -march=geode -funit-at-a-time -mmmx -m3dnow" libz.a libz.so.1.2.5
7make[4]: Entering directory `/build/geode/openwrt.svn/build_dir/target-i486-openwrt-linux-gnu/zlib-1.2.5'
8make[4]: `libz.a' is up to date.
9make[4]: *** No rule to make target `libz.so.1.2.5'.  Stop.
10make[4]: Leaving directory `/build/geode/openwrt.svn/build_dir/target-i486-openwrt-linux-gnu/zlib-1.2.5'
11make[3]: *** [/build/geode/openwrt.svn/build_dir/target-i486-openwrt-linux-gnu/zlib-1.2.5/.built] Error 2
12make[3]: Leaving directory `/build/geode/openwrt.svn/package/zlib'
13make[2]: *** [package/zlib/compile] Error 2
14make[2]: Leaving directory `/build/geode/openwrt.svn'
15make[1]: *** [/build/geode/openwrt.svn/staging_dir/target-i486-openwrt-linux-gnu/stamp/.package_compile] Error 2
16make[1]: Leaving directory `/build/geode/openwrt.svn'
17make: *** [world] Fehler 2
18