Ticket #7: ticket#7.txt

File ticket#7.txt, 3.7 KB (added by nico, 12 years ago)

Detailled log of error

Line 
1make -C /home/projects/openwrt/branches/trunk/test-mipsel-2.6/build_mipsel/linux-2.6-brcm/linux-2.6.12.5 SUBDIRS=/home/projects/openwrt/branches/trunk/test-mipsel-2.6/build_mipsel/linux-2.6-brcm/alsa-driver-1.0.10rc1  modules
2make[10]: Entering directory `/home/projects/openwrt/branches/trunk/test-mipsel-2.6/build_mipsel/linux-2.6-brcm/linux-2.6.12.5'
3  CC [M]  /home/projects/openwrt/branches/trunk/test-mipsel-2.6/build_mipsel/linux-2.6-brcm/alsa-driver-1.0.10rc1/acore/hwdep.o
4In file included from /home/projects/openwrt/branches/trunk/test-mipsel-2.6/build_mipsel/linux-2.6-brcm/alsa-driver-1.0.10rc1/include/sound/driver.h:42,
5                 from /home/projects/openwrt/branches/trunk/test-mipsel-2.6/build_mipsel/linux-2.6-brcm/alsa-driver-1.0.10rc1/acore/hwdep.c:22:
6/home/projects/openwrt/branches/trunk/test-mipsel-2.6/build_mipsel/linux-2.6-brcm/alsa-driver-1.0.10rc1/include/adriver.h:642: error: redefinition of 'jiffies_to_msecs'
7include/linux/jiffies.h:256: error: previous definition of 'jiffies_to_msecs' was here
8/home/projects/openwrt/branches/trunk/test-mipsel-2.6/build_mipsel/linux-2.6-brcm/alsa-driver-1.0.10rc1/include/adriver.h:662: error: redefinition of 'msecs_to_jiffies'
9include/linux/jiffies.h:278: error: previous definition of 'msecs_to_jiffies' was here
10In file included from /home/projects/openwrt/branches/trunk/test-mipsel-2.6/build_mipsel/linux-2.6-brcm/alsa-driver-1.0.10rc1/include/adriver.h:737,
11                 from /home/projects/openwrt/branches/trunk/test-mipsel-2.6/build_mipsel/linux-2.6-brcm/alsa-driver-1.0.10rc1/include/sound/driver.h:42,
12                 from /home/projects/openwrt/branches/trunk/test-mipsel-2.6/build_mipsel/linux-2.6-brcm/alsa-driver-1.0.10rc1/acore/hwdep.c:22:
13include/linux/pci.h:814: error: parse error before numeric constant
14make[12]: *** [/home/projects/openwrt/branches/trunk/test-mipsel-2.6/build_mipsel/linux-2.6-brcm/alsa-driver-1.0.10rc1/acore/hwdep.o] Error 1
15make[11]: *** [/home/projects/openwrt/branches/trunk/test-mipsel-2.6/build_mipsel/linux-2.6-brcm/alsa-driver-1.0.10rc1/acore] Error 2
16make[10]: *** [_module_/home/projects/openwrt/branches/trunk/test-mipsel-2.6/build_mipsel/linux-2.6-brcm/alsa-driver-1.0.10rc1] Error 2
17make[10]: Leaving directory `/home/projects/openwrt/branches/trunk/test-mipsel-2.6/build_mipsel/linux-2.6-brcm/linux-2.6.12.5'
18make[9]: *** [compile] Error 2
19make[9]: Leaving directory `/home/projects/openwrt/branches/trunk/test-mipsel-2.6/build_mipsel/linux-2.6-brcm/alsa-driver-1.0.10rc1'
20make[8]: *** [/home/projects/openwrt/branches/trunk/test-mipsel-2.6/build_mipsel/linux-2.6-brcm/alsa-driver-1.0.10rc1/.built] Error 2
21make[8]: Leaving directory `/home/projects/openwrt/branches/trunk/test-mipsel-2.6/target/linux/package/alsa'
22make[7]: *** [compile] Error 2
23make[7]: Leaving directory `/home/projects/openwrt/branches/trunk/test-mipsel-2.6/target/linux/package/alsa'
24make[6]: *** [alsa-compile] Error 2
25make[6]: Leaving directory `/home/projects/openwrt/branches/trunk/test-mipsel-2.6/target/linux/package'
26make[5]: *** [/home/projects/openwrt/branches/trunk/test-mipsel-2.6/build_mipsel/stamp/.linux-compile] Error 2
27make[5]: Leaving directory `/home/projects/openwrt/branches/trunk/test-mipsel-2.6/target/linux/linux-2.6'
28make[4]: *** [compile] Error 2
29make[4]: Leaving directory `/home/projects/openwrt/branches/trunk/test-mipsel-2.6/target/linux/linux-2.6'
30make[3]: *** [2.6/brcm-compile] Error 2
31make[3]: Leaving directory `/home/projects/openwrt/branches/trunk/test-mipsel-2.6/target/linux'
32make[2]: *** [linux-compile] Error 2
33make[2]: Leaving directory `/home/projects/openwrt/branches/trunk/test-mipsel-2.6/target'
34make[1]: *** [target/compile] Error 2
35make[1]: Leaving directory `/home/projects/openwrt/branches/trunk/test-mipsel-2.6'
36make: *** [world] Error 2