Ticket #3769: zd1211rw-compile-error.txt

File zd1211rw-compile-error.txt, 7.2 KB (added by axel@…, 10 years ago)

make V=99 compile log

Line 
1...
2
3make[3]: Entering directory `/home/usr_src/openWrt/build/kamikaze-x86/kamikaze/package/mac80211'
4rm -rf /home/usr_src/openWrt/build/kamikaze-x86/kamikaze/build_dir/linux-x86_generic/compat-wireless-2008-05-26
5mkdir -p /home/usr_src/openWrt/build/kamikaze-x86/kamikaze/build_dir/linux-x86_generic/compat-wireless-2008-05-26
6bzcat /home/usr_src/openWrt/build/kamikaze-x86/kamikaze/dl/compat-wireless-2008-05-26.tar.bz2 | /bin/tar -C /home/usr_src/openWrt/build/kamikaze-x86/kamikaze/build_dir/linux-x86_generic/compat-wireless-2008-05-26/.. -xf -
7
8Applying ./patches/001-disable_drivers.patch using plaintext:
9patching file config.mk
10unzip -jod /home/usr_src/openWrt/build/kamikaze-x86/kamikaze/build_dir/linux-x86_generic/compat-wireless-2008-05-26 /home/usr_src/openWrt/build/kamikaze-x86/kamikaze/dl/RT61_Firmware_V1.2.zip
11Archive:  /home/usr_src/openWrt/build/kamikaze-x86/kamikaze/dl/RT61_Firmware_V1.2.zip
12  inflating: /home/usr_src/openWrt/build/kamikaze-x86/kamikaze/build_dir/linux-x86_generic/compat-wireless-2008-05-26/rt2561.bin
13  inflating: /home/usr_src/openWrt/build/kamikaze-x86/kamikaze/build_dir/linux-x86_generic/compat-wireless-2008-05-26/rt2561s.bin
14  inflating: /home/usr_src/openWrt/build/kamikaze-x86/kamikaze/build_dir/linux-x86_generic/compat-wireless-2008-05-26/rt2661.bin
15  inflating: /home/usr_src/openWrt/build/kamikaze-x86/kamikaze/build_dir/linux-x86_generic/compat-wireless-2008-05-26/LICENSE.ralink-firmware.txt
16unzip -jod /home/usr_src/openWrt/build/kamikaze-x86/kamikaze/build_dir/linux-x86_generic/compat-wireless-2008-05-26 /home/usr_src/openWrt/build/kamikaze-x86/kamikaze/dl/RT71W_Firmware_V1.8.zip
17Archive:  /home/usr_src/openWrt/build/kamikaze-x86/kamikaze/dl/RT71W_Firmware_V1.8.zip
18  inflating: /home/usr_src/openWrt/build/kamikaze-x86/kamikaze/build_dir/linux-x86_generic/compat-wireless-2008-05-26/rt73.bin
19  inflating: /home/usr_src/openWrt/build/kamikaze-x86/kamikaze/build_dir/linux-x86_generic/compat-wireless-2008-05-26/LICENSE.ralink-firmware.txt
20rm -rf /home/usr_src/openWrt/build/kamikaze-x86/kamikaze/build_dir/linux-x86_generic/compat-wireless-2008-05-26/include/linux/ssb
21touch /home/usr_src/openWrt/build/kamikaze-x86/kamikaze/build_dir/linux-x86_generic/compat-wireless-2008-05-26/.prepared_6f91446f8011c2b046a4242693b84f13
22(cd /home/usr_src/openWrt/build/kamikaze-x86/kamikaze/build_dir/linux-x86_generic/compat-wireless-2008-05-26/./; if [ -x ./configure ]; then cp -fpR /home/usr_src/openWrt/build/kamikaze-x86/kamikaze/scripts/config.{guess,sub} /home/usr_src/openWrt/build/kamikaze-x86/kamikaze/build_dir/linux-x86_generic/compat-wireless-2008-05-26// && AR=i386-linux-uclibc-ar AS="i386-linux-uclibc-gcc -c -O2 -pipe -march=i486 -funit-at-a-time -fhonour-copts" LD=i386-linux-uclibc-ld NM=i386-linux-uclibc-nm CC="i386-linux-uclibc-gcc" GCC="i386-linux-uclibc-gcc" CXX=i386-linux-uclibc-g++ RANLIB=i386-linux-uclibc-ranlib STRIP=i386-linux-uclibc-strip OBJCOPY=i386-linux-uclibc-objcopy OBJDUMP=i386-linux-uclibc-objdump SIZE=i386-linux-uclibc-size CFLAGS="-O2 -pipe -march=i486 -funit-at-a-time -fhonour-copts " CXXFLAGS="-O2 -pipe -march=i486 -funit-at-a-time -fhonour-copts " CPPFLAGS="-I/home/usr_src/openWrt/build/kamikaze-x86/kamikaze/staging_dir/i386/usr/include -I/home/usr_src/openWrt/build/kamikaze-x86/kamikaze/staging_dir/i386/include " LDFLAGS="-L/home/usr_src/openWrt/build/kamikaze-x86/kamikaze/staging_dir/toolchain-i386_gcc4.1.2/lib -L/home/usr_src/openWrt/build/kamikaze-x86/kamikaze/staging_dir/i386/usr/lib -L/home/usr_src/openWrt/build/kamikaze-x86/kamikaze/staging_dir/i386/lib " PKG_CONFIG_PATH="/home/usr_src/openWrt/build/kamikaze-x86/kamikaze/staging_dir/i386/usr/lib/pkgconfig:/home/usr_src/openWrt/build/kamikaze-x86/kamikaze/staging_dir/host/usr/lib/pkgconfig" PKG_CONFIG_LIBDIR="/home/usr_src/openWrt/build/kamikaze-x86/kamikaze/staging_dir/i386/usr/lib/pkgconfig"  ./configure --target=i386-linux --host=i386-linux --build=i486-linux-gnu --program-prefix="" --program-suffix="" --prefix=/usr --exec-prefix=/usr --bindir=/usr/bin --sbindir=/usr/sbin --libexecdir=/usr/lib --sysconfdir=/etc --datadir=/usr/share --localstatedir=/var --mandir=/usr/man --infodir=/usr/info --disable-nls ; fi; )
23touch /home/usr_src/openWrt/build/kamikaze-x86/kamikaze/build_dir/linux-x86_generic/compat-wireless-2008-05-26/.configured
24touch /home/usr_src/openWrt/build/kamikaze-x86/kamikaze/build_dir/linux-x86_generic/compat-wireless-2008-05-26/.built
25mkdir -p /home/usr_src/openWrt/build/kamikaze-x86/kamikaze/build_dir/linux-x86_generic/compat-wireless-2008-05-26/ipkg/kmod-net-zd1211rw/CONTROL
26echo "Package: kmod-net-zd1211rw" > /home/usr_src/openWrt/build/kamikaze-x86/kamikaze/build_dir/linux-x86_generic/compat-wireless-2008-05-26/ipkg/kmod-net-zd1211rw/CONTROL/control
27echo "Version: 2.6.25.10+2008-05-26-x86-1" >> /home/usr_src/openWrt/build/kamikaze-x86/kamikaze/build_dir/linux-x86_generic/compat-wireless-2008-05-26/ipkg/kmod-net-zd1211rw/CONTROL/control
28( DEPENDS='kernel (=2.6.25.10-x86-1)'; for depend in +kmod-ieee80211-softmac; do DEPENDS=${DEPENDS:+$DEPENDS, }${depend##+}; done; echo "Depends: $DEPENDS"; echo "Provides: "; echo "Source: package/mac80211"; echo "Section: kernel"; echo "Priority: optional"; echo "Maintainer: OpenWrt Developers Team <openwrt-devel@openwrt.org>"; echo "Architecture: i386"; echo -n "Description: "; getvar V_Package_kmod_net_zd1211rw_description | sed -e 's,^[[:space:]]*, ,g'; ) >> /home/usr_src/openWrt/build/kamikaze-x86/kamikaze/build_dir/linux-x86_generic/compat-wireless-2008-05-26/ipkg/kmod-net-zd1211rw/CONTROL/control
29chmod 644 /home/usr_src/openWrt/build/kamikaze-x86/kamikaze/build_dir/linux-x86_generic/compat-wireless-2008-05-26/ipkg/kmod-net-zd1211rw/CONTROL/control
30(cd /home/usr_src/openWrt/build/kamikaze-x86/kamikaze/build_dir/linux-x86_generic/compat-wireless-2008-05-26/ipkg/kmod-net-zd1211rw/CONTROL; var2file "V_Package_kmod_net_zd1211rw_conffiles" conffiles; var2file "V_Package_kmod_net_zd1211rw_preinst" preinst; var2file "V_Package_kmod_net_zd1211rw_postinst" postinst; var2file "V_Package_kmod_net_zd1211rw_prerm" prerm; var2file "V_Package_kmod_net_zd1211rw_postrm" postrm; )
31mkdir -p /home/usr_src/openWrt/build/kamikaze-x86/kamikaze/build_dir/linux-x86_generic/compat-wireless-2008-05-26/ipkg/kmod-net-zd1211rw/lib/modules/2.6.25.10
32cp -fpR -L /home/usr_src/openWrt/build/kamikaze-x86/kamikaze/build_dir/linux-x86_generic/compat-wireless-2008-05-26/drivers/net/wireless/zd1211rw/zd1211rw.ko /home/usr_src/openWrt/build/kamikaze-x86/kamikaze/build_dir/linux-x86_generic/compat-wireless-2008-05-26/ipkg/kmod-net-zd1211rw/lib/modules/2.6.25.10/
33cp: cannot stat `/home/usr_src/openWrt/build/kamikaze-x86/kamikaze/build_dir/linux-x86_generic/compat-wireless-2008-05-26/drivers/net/wireless/zd1211rw/zd1211rw.ko': No such file or directory
34make[3]: *** [/home/usr_src/openWrt/build/kamikaze-x86/kamikaze/bin/packages/i386/kmod-net-zd1211rw_2.6.25.10+2008-05-26-x86-1_i386.ipk] Error 1
35make[3]: Leaving directory `/home/usr_src/openWrt/build/kamikaze-x86/kamikaze/package/mac80211'
36make[2]: *** [package/mac80211/compile] Error 2
37make[2]: Leaving directory `/home/usr_src/openWrt/build/kamikaze-x86/kamikaze'
38make[1]: *** [/home/usr_src/openWrt/build/kamikaze-x86/kamikaze/staging_dir/i386/stamp/.package_compile] Error 2
39make[1]: Leaving directory `/home/usr_src/openWrt/build/kamikaze-x86/kamikaze'
40make: *** [world] Fehler 2