Ticket #3065: urbi-buildlog.txt

File urbi-buildlog.txt, 5.2 KB (added by anonymous, 10 years ago)
Line 
1make[1]: Entering directory `/home/openwrt/builds/trunk_ixp4xx'
2make[2]: Entering directory `/home/openwrt/builds/trunk_ixp4xx/feeds/packages/libs/uclibc++'
3make[2]: Leaving directory `/home/openwrt/builds/trunk_ixp4xx/feeds/packages/libs/uclibc++'
4make[2]: Entering directory `/home/openwrt/builds/trunk_ixp4xx/feeds/packages/lang/urbi'
5make -C /home/openwrt/builds/trunk_ixp4xx/build_dir/armeb/urbi-sdk AR=armeb-linux-uclibc-ar AS="armeb-linux-uclibc-gcc -c -Os -pipe -mabi=aapcs-linux -march=armv5te -mtune=xscale -funit-at-a-time -fhonour-copts -msoft-float" LD=armeb-linux-uclibc-ld NM=armeb-linux-uclibc-nm CC="armeb-linux-uclibc-gcc" GCC="armeb-linux-uclibc-gcc" CXX=armeb-linux-uclibc-g++ RANLIB=armeb-linux-uclibc-ranlib STRIP=armeb-linux-uclibc-strip OBJCOPY=armeb-linux-uclibc-objcopy OBJDUMP=armeb-linux-uclibc-objdump SIZE=armeb-linux-uclibc-size DESTDIR="/home/openwrt/builds/trunk_ixp4xx/build_dir/armeb/urbi-sdk/ipkg-install" all install
6make[3]: Entering directory `/home/openwrt/builds/trunk_ixp4xx/build_dir/armeb/urbi-sdk'
7make  all-recursive
8make[4]: Entering directory `/home/openwrt/builds/trunk_ixp4xx/build_dir/armeb/urbi-sdk'
9Making all in jpeg-6b
10make[5]: Entering directory `/home/openwrt/builds/trunk_ixp4xx/build_dir/armeb/urbi-sdk/jpeg-6b'
11make  all-am
12make[6]: Entering directory `/home/openwrt/builds/trunk_ixp4xx/build_dir/armeb/urbi-sdk/jpeg-6b'
13make[6]: Nothing to be done for `all-am'.
14make[6]: Leaving directory `/home/openwrt/builds/trunk_ixp4xx/build_dir/armeb/urbi-sdk/jpeg-6b'
15make[5]: Leaving directory `/home/openwrt/builds/trunk_ixp4xx/build_dir/armeb/urbi-sdk/jpeg-6b'
16Making all in libport/tests
17make[5]: Entering directory `/home/openwrt/builds/trunk_ixp4xx/build_dir/armeb/urbi-sdk/libport/tests'
18make  all-am
19make[6]: Entering directory `/home/openwrt/builds/trunk_ixp4xx/build_dir/armeb/urbi-sdk/libport/tests'
20make[6]: Nothing to be done for `all-am'.
21make[6]: Leaving directory `/home/openwrt/builds/trunk_ixp4xx/build_dir/armeb/urbi-sdk/libport/tests'
22make[5]: Leaving directory `/home/openwrt/builds/trunk_ixp4xx/build_dir/armeb/urbi-sdk/libport/tests'
23Making all in sdk
24make[5]: Entering directory `/home/openwrt/builds/trunk_ixp4xx/build_dir/armeb/urbi-sdk/sdk'
25make  all-am
26make[6]: Entering directory `/home/openwrt/builds/trunk_ixp4xx/build_dir/armeb/urbi-sdk/sdk'
27make[6]: Nothing to be done for `all-am'.
28make[6]: Leaving directory `/home/openwrt/builds/trunk_ixp4xx/build_dir/armeb/urbi-sdk/sdk'
29make[5]: Leaving directory `/home/openwrt/builds/trunk_ixp4xx/build_dir/armeb/urbi-sdk/sdk'
30Making all in src
31make[5]: Entering directory `/home/openwrt/builds/trunk_ixp4xx/build_dir/armeb/urbi-sdk/src'
32Making all in liburbi
33make[6]: Entering directory `/home/openwrt/builds/trunk_ixp4xx/build_dir/armeb/urbi-sdk/src/liburbi'
34make  all-recursive
35make[7]: Entering directory `/home/openwrt/builds/trunk_ixp4xx/build_dir/armeb/urbi-sdk/src/liburbi'
36Making all in .
37make[8]: Entering directory `/home/openwrt/builds/trunk_ixp4xx/build_dir/armeb/urbi-sdk/src/liburbi'
38make[8]: Nothing to be done for `all-am'.
39make[8]: Leaving directory `/home/openwrt/builds/trunk_ixp4xx/build_dir/armeb/urbi-sdk/src/liburbi'
40make[7]: Leaving directory `/home/openwrt/builds/trunk_ixp4xx/build_dir/armeb/urbi-sdk/src/liburbi'
41make[6]: Leaving directory `/home/openwrt/builds/trunk_ixp4xx/build_dir/armeb/urbi-sdk/src/liburbi'
42Making all in utils
43make[6]: Entering directory `/home/openwrt/builds/trunk_ixp4xx/build_dir/armeb/urbi-sdk/src/utils'
44make  all-am
45make[7]: Entering directory `/home/openwrt/builds/trunk_ixp4xx/build_dir/armeb/urbi-sdk/src/utils'
46armeb-linux-uclibc-g++ -DHAVE_CONFIG_H   -I../.. -I../.. -I../../jpeg-6b -I../../include -I../../src/liburbi/uobject -I/home/openwrt/builds/trunk_ixp4xx/staging_dir/armeb/usr/include -I/home/openwrt/builds/trunk_ixp4xx/staging_dir/armeb/include  -pthread -Wno-deprecated -Wall -W -Woverloaded-virtual -Wformat -Werror -Os -pipe -mabi=aapcs-linux -march=armv5te -mtune=xscale -funit-at-a-time -fhonour-copts -msoft-float  -fno-rtti -pipe -MT urbicycle.o -MD -MP -MF .deps/urbicycle.Tpo -c -o urbicycle.o urbicycle.cc
47cc1plus: warnings being treated as errors
48urbicycle.cc: In function 'int parseHeader(FILE*, FILE*)':
49urbicycle.cc:61: warning: comparison is always false due to limited range of data type
50make[7]: *** [urbicycle.o] Error 1
51make[7]: Leaving directory `/home/openwrt/builds/trunk_ixp4xx/build_dir/armeb/urbi-sdk/src/utils'
52make[6]: *** [all] Error 2
53make[6]: Leaving directory `/home/openwrt/builds/trunk_ixp4xx/build_dir/armeb/urbi-sdk/src/utils'
54make[5]: *** [all-recursive] Error 1
55make[5]: Leaving directory `/home/openwrt/builds/trunk_ixp4xx/build_dir/armeb/urbi-sdk/src'
56make[4]: *** [all-recursive] Error 1
57make[4]: Leaving directory `/home/openwrt/builds/trunk_ixp4xx/build_dir/armeb/urbi-sdk'
58make[3]: *** [all] Error 2
59make[3]: Leaving directory `/home/openwrt/builds/trunk_ixp4xx/build_dir/armeb/urbi-sdk'
60make[2]: *** [/home/openwrt/builds/trunk_ixp4xx/build_dir/armeb/urbi-sdk/.built] Error 2
61make[2]: Leaving directory `/home/openwrt/builds/trunk_ixp4xx/feeds/packages/lang/urbi'
62make[1]: *** [package/openwrt-packages/lang/urbi/compile] Error 2
63make[1]: Leaving directory `/home/openwrt/builds/trunk_ixp4xx'
64make: *** [package/urbi/compile] Fehler 2