Ticket #2567: fuse-buildlog.txt

File fuse-buildlog.txt, 14.7 KB (added by anonymous, 10 years ago)
Line 
1make[1]: Entering directory `/home/ubuntu/openwrt/test/trunk-1'
2make[2]: Entering directory `/home/ubuntu/openwrt/test/trunk-1/package/fuse'
3rm -f /home/ubuntu/openwrt/test/trunk-1/bin/packages//fuse-utils_*
4rm -f /home/ubuntu/openwrt/test/trunk-1/bin/packages//libfuse_*
5rm -f /home/ubuntu/openwrt/test/trunk-1/bin/packages//kmod-fuse_*
6rm -rf  /home/ubuntu/openwrt/test/trunk-1/staging_dir/i386/usr/include/fuse{,.h} /home/ubuntu/openwrt/test/trunk-1/staging_dir/i386/usr/lib/libfuse.{a,so*} /home/ubuntu/openwrt/test/trunk-1/staging_dir/i386/usr/lib/pkgconfig/fuse.pc
7make[2]: Leaving directory `/home/ubuntu/openwrt/test/trunk-1/package/fuse'
8make[1]: Leaving directory `/home/ubuntu/openwrt/test/trunk-1'
9make[1]: Entering directory `/home/ubuntu/openwrt/test/trunk-1'
10make[2]: Entering directory `/home/ubuntu/openwrt/test/trunk-1/package/fuse'
11gzip -dc /home/ubuntu/openwrt/test/trunk-1/dl/fuse-2.6.5.tar.gz | /bin/tar -C /home/ubuntu/openwrt/test/trunk-1/build_dir/linux-x86_generic/fuse-2.6.5/.. -xf -
12
13Applying ./patches/100-cross_compile.patch using plaintext:
14patching file kernel/configure
15
16Applying ./patches/102-no_depmod.patch using plaintext:
17patching file kernel/Makefile.in
18
19Applying ./patches/112-no_break_on_mknod.patch using plaintext:
20patching file util/Makefile.in
21
22Applying ./patches/200-disable_compat.patch using plaintext:
23patching file include/fuse_common_compat.h
24patching file lib/fuse.c
25patching file lib/fuse_lowlevel.c
26patching file lib/helper.c
27patching file lib/mount.c
28
29Applying ./patches/210-posix_test_lock.patch using plaintext:
30patching file kernel/file.c
31
32Applying ./patches/220-kmem_cache.patch using plaintext:
33patching file kernel/dev.c
34patching file kernel/inode.c
35
36Applying ./patches/230-kobj.patch using plaintext:
37patching file kernel/inode.c
38touch /home/ubuntu/openwrt/test/trunk-1/build_dir/linux-x86_generic/fuse-2.6.5/.prepared_ae72313c1e26dc64ab0a5bab1ce49fe8
39(cd /home/ubuntu/openwrt/test/trunk-1/build_dir/linux-x86_generic/fuse-2.6.5; rm -f config.cache; touch configure.in ; touch aclocal.m4 ; touch Makefile.in ; touch include/config.h.in ; touch configure ; )
40(cd /home/ubuntu/openwrt/test/trunk-1/build_dir/linux-x86_generic/fuse-2.6.5/./; if [ -x ./configure ]; then cp -fpR /home/ubuntu/openwrt/test/trunk-1/scripts/config.{guess,sub} /home/ubuntu/openwrt/test/trunk-1/build_dir/linux-x86_generic/fuse-2.6.5// && AR=i386-linux-uclibc-ar AS="i386-linux-uclibc-gcc -c -Os -pipe -funit-at-a-time -fhonour-copts" LD=i386-linux-uclibc-ld NM=i386-linux-uclibc-nm CC="i386-linux-uclibc-gcc" GCC="i386-linux-uclibc-gcc" CXX=i386-linux-uclibc-g++ RANLIB=i386-linux-uclibc-ranlib STRIP=i386-linux-uclibc-strip OBJCOPY=i386-linux-uclibc-objcopy OBJDUMP=i386-linux-uclibc-objdump SIZE=i386-linux-uclibc-size CFLAGS="-Os -pipe -funit-at-a-time -fhonour-copts " CXXFLAGS="-Os -pipe -funit-at-a-time -fhonour-copts " CPPFLAGS="-I/home/ubuntu/openwrt/test/trunk-1/staging_dir/i386/usr/include -I/home/ubuntu/openwrt/test/trunk-1/staging_dir/i386/include " LDFLAGS="-L/home/ubuntu/openwrt/test/trunk-1/staging_dir/i386/usr/lib -L/home/ubuntu/openwrt/test/trunk-1/staging_dir/i386/lib " PKG_CONFIG_PATH="/home/ubuntu/openwrt/test/trunk-1/staging_dir/i386/usr/lib/pkgconfig" PKG_CONFIG_LIBDIR="/home/ubuntu/openwrt/test/trunk-1/staging_dir/i386/usr/lib/pkgconfig" kernsrcver="2.6.23"  ./configure --target=i386-linux --host=i386-linux --build=i486-linux-gnu --program-prefix="" --program-suffix="" --prefix=/usr --exec-prefix=/usr --bindir=/usr/bin --sbindir=/usr/sbin --libexecdir=/usr/lib --sysconfdir=/etc --datadir=/usr/share --localstatedir=/var --mandir=/usr/man --infodir=/usr/info --disable-nls --enable-shared --enable-static --disable-rpath --enable-kernel-module --enable-lib --enable-util --disable-example --disable-auto-modprobe --with-kernel="/home/ubuntu/openwrt/test/trunk-1/build_dir/linux-x86_generic/linux-2.6.23" --disable-mtab ; fi; )
41configure: loading site script /home/ubuntu/openwrt/test/trunk-1/include/site/i386-linux-uclibc
42checking build system type... i486-pc-linux-gnu
43checking host system type... i386-pc-linux-gnu
44checking target system type... i386-pc-linux-gnu
45checking for a BSD-compatible install... /usr/bin/install -c
46checking whether build environment is sane... yes
47checking for gawk... gawk
48checking whether make sets $(MAKE)... yes
49checking for i386-linux-strip... i386-linux-uclibc-strip
50checking for style of include used by make... GNU
51checking for i386-linux-gcc... i386-linux-uclibc-gcc
52checking for C compiler default output file name... a.out
53checking whether the C compiler works... yes
54checking whether we are cross compiling... yes
55checking for suffix of executables...
56checking for suffix of object files... o
57checking whether we are using the GNU C compiler... yes
58checking whether i386-linux-uclibc-gcc accepts -g... yes
59checking for i386-linux-uclibc-gcc option to accept ISO C89... none needed
60checking dependency style of i386-linux-uclibc-gcc... gcc3
61checking for a sed that does not truncate output... /home/ubuntu/openwrt/test/trunk-1/staging_dir/host/bin/sed
62checking for grep that handles long lines and -e... /bin/grep
63checking for egrep... /bin/grep -E
64checking for fgrep... /bin/grep -F
65checking for ld used by i386-linux-uclibc-gcc... i386-linux-uclibc-ld
66checking if the linker (i386-linux-uclibc-ld) is GNU ld... yes
67checking for BSD- or MS-compatible name lister (nm)... i386-linux-uclibc-nm
68checking the name lister (i386-linux-uclibc-nm) interface... BSD nm
69checking whether ln -s works... yes
70checking the maximum length of command line arguments... 32768
71checking whether the shell understands some XSI constructs... yes
72checking for i386-linux-uclibc-ld option to reload object files... -r
73checking how to recognise dependent libraries... pass_all
74checking for i386-linux-ar... i386-linux-uclibc-ar
75checking for i386-linux-strip... (cached) i386-linux-uclibc-strip
76checking for i386-linux-ranlib... i386-linux-uclibc-ranlib
77checking command to parse i386-linux-uclibc-nm output from i386-linux-uclibc-gcc object... ok
78checking how to run the C preprocessor... i386-linux-uclibc-gcc -E
79checking for ANSI C header files... yes
80checking for sys/types.h... yes
81checking for sys/stat.h... yes
82checking for stdlib.h... yes
83checking for string.h... yes
84checking for memory.h... yes
85checking for strings.h... yes
86checking for inttypes.h... yes
87checking for stdint.h... yes
88checking for unistd.h... yes
89checking for dlfcn.h... yes
90checking for objdir... .libs
91checking if i386-linux-uclibc-gcc supports -fno-rtti -fno-exceptions... no
92checking for i386-linux-uclibc-gcc option to produce PIC... -fPIC -DPIC
93checking if i386-linux-uclibc-gcc PIC flag -fPIC -DPIC works... yes
94checking if i386-linux-uclibc-gcc static flag -static works... yes
95checking if i386-linux-uclibc-gcc supports -c -o file.o... yes
96checking if i386-linux-uclibc-gcc supports -c -o file.o... (cached) yes
97checking whether the i386-linux-uclibc-gcc linker (i386-linux-uclibc-ld) supports shared libraries... yes
98checking whether -lc should be explicitly linked in... no
99checking dynamic linker characteristics... cat: /etc/ld.so.conf.d/*.conf: No such file or directory
100GNU/Linux ld.so
101checking how to hardcode library paths into programs... immediate
102checking whether stripping libraries is possible... yes
103checking if libtool supports shared libraries... yes
104checking whether to build shared libraries... yes
105checking whether to build static libraries... yes
106checking for i386-linux-gcc... (cached) i386-linux-uclibc-gcc
107checking whether we are using the GNU C compiler... (cached) yes
108checking whether i386-linux-uclibc-gcc accepts -g... (cached) yes
109checking for i386-linux-uclibc-gcc option to accept ISO C89... (cached) none needed
110checking dependency style of i386-linux-uclibc-gcc... (cached) gcc3
111checking whether i386-linux-uclibc-gcc and cc understand -c and -o together... yes
112checking for fork... yes
113checking for setxattr... yes
114checking for fdatasync... yes
115checking for struct stat.st_atim... no
116checking for struct stat.st_atimespec... no
117checking for library containing clock_gettime... none required
118checking selinux/selinux.h usability... no
119checking selinux/selinux.h presence... no
120checking for selinux/selinux.h... no
121configure: creating ./config.status
122config.status: creating fuse.pc
123config.status: creating Makefile
124config.status: creating lib/Makefile
125config.status: creating util/Makefile
126config.status: creating example/Makefile
127config.status: creating include/Makefile
128config.status: creating include/config.h
129config.status: executing depfiles commands
130config.status: executing libtool commands
131=== configuring in kernel (/home/ubuntu/openwrt/test/trunk-1/build_dir/linux-x86_generic/fuse-2.6.5/kernel)
132configure: running /bin/sh ./configure '--prefix=/usr'  '--target=i386-linux' '--host=i386-linux' '--build=i486-linux-gnu' '--program-prefix=' '--program-suffix=' '--exec-prefix=/usr' '--bindir=/usr/bin' '--sbindir=/usr/sbin' '--libexecdir=/usr/lib' '--sysconfdir=/etc' '--datadir=/usr/share' '--localstatedir=/var' '--mandir=/usr/man' '--infodir=/usr/info' '--disable-nls' '--enable-shared' '--enable-static' '--disable-rpath' '--enable-kernel-module' '--enable-lib' '--enable-util' '--disable-example' '--disable-auto-modprobe' '--with-kernel=/home/ubuntu/openwrt/test/trunk-1/build_dir/linux-x86_generic/linux-2.6.23' '--disable-mtab' 'build_alias=i486-linux-gnu' 'host_alias=i386-linux' 'target_alias=i386-linux' 'CC=i386-linux-uclibc-gcc' 'CFLAGS=-Os -pipe -funit-at-a-time -fhonour-copts ' 'LDFLAGS=-L/home/ubuntu/openwrt/test/trunk-1/staging_dir/i386/usr/lib -L/home/ubuntu/openwrt/test/trunk-1/staging_dir/i386/lib ' 'CPPFLAGS=-I/home/ubuntu/openwrt/test/trunk-1/staging_dir/i386/usr/include -I/home/ubuntu/openwrt/test/trunk-1/staging_dir/i386/include ' --cache-file=/dev/null --srcdir=.
133configure: loading site script /home/ubuntu/openwrt/test/trunk-1/include/site/i386-linux-uclibc
134checking for a BSD-compatible install... /usr/bin/install -c
135checking kernel source directory... /home/ubuntu/openwrt/test/trunk-1/build_dir/linux-x86_generic/linux-2.6.23
136checking kernel build directory... /home/ubuntu/openwrt/test/trunk-1/build_dir/linux-x86_generic/linux-2.6.23
137checking kernel source version... 2.6.23 (cached)
1382.6.23
139checking if FUSE is configured in the kernel... no
140checking if kernel defines kzalloc function... yes
141checking if kernel defines fs_subsys... yes
142checking whether lookup_instantiate_filp is defined... yes
143checking if umount_begin is passed a vfsmount... yes
144checking if inode has i_blksize field... no
145checking if inode has i_private field... yes
146checking if inode has i_mutex field ... yes
147checking if kernel has mutex.h ... yes
148checking if kernel has BLOCK option ... no
149checking if this is user mode linux... no
150configure: creating ./config.status
151config.status: creating Makefile
152config.status: creating config.h
153touch /home/ubuntu/openwrt/test/trunk-1/build_dir/linux-x86_generic/fuse-2.6.5/.configured
154make -C /home/ubuntu/openwrt/test/trunk-1/build_dir/linux-x86_generic/fuse-2.6.5 ARCH="i386" CROSS_COMPILE="i386-linux-uclibc-" DESTDIR="/home/ubuntu/openwrt/test/trunk-1/build_dir/linux-x86_generic/fuse-2.6.5/ipkg-install" AM_CFLAGS="-Os -pipe -funit-at-a-time -fhonour-copts -DDISABLE_COMPAT=1" EXTRA_DIST="" all install
155make[3]: Entering directory `/home/ubuntu/openwrt/test/trunk-1/build_dir/linux-x86_generic/fuse-2.6.5'
156Making all in kernel
157make[4]: Entering directory `/home/ubuntu/openwrt/test/trunk-1/build_dir/linux-x86_generic/fuse-2.6.5/kernel'
158make -C /home/ubuntu/openwrt/test/trunk-1/build_dir/linux-x86_generic/linux-2.6.23 SUBDIRS=`pwd`  modules
159make[5]: Entering directory `/home/ubuntu/openwrt/test/trunk-1/build_dir/linux-x86_generic/linux-2.6.23'
160  CC [M]  /home/ubuntu/openwrt/test/trunk-1/build_dir/linux-x86_generic/fuse-2.6.5/kernel/dev.o
161In file included from /home/ubuntu/openwrt/test/trunk-1/build_dir/linux-x86_generic/fuse-2.6.5/kernel/dev.c:9:
162/home/ubuntu/openwrt/test/trunk-1/build_dir/linux-x86_generic/fuse-2.6.5/kernel/fuse_i.h:81:1: warning: "CONFIG_BLOCK" redefined
163In file included from <command line>:1:
164./include/linux/autoconf.h:381:1: warning: this is the location of the previous definition
165  CC [M]  /home/ubuntu/openwrt/test/trunk-1/build_dir/linux-x86_generic/fuse-2.6.5/kernel/dir.o
166In file included from /home/ubuntu/openwrt/test/trunk-1/build_dir/linux-x86_generic/fuse-2.6.5/kernel/dir.c:9:
167/home/ubuntu/openwrt/test/trunk-1/build_dir/linux-x86_generic/fuse-2.6.5/kernel/fuse_i.h:81:1: warning: "CONFIG_BLOCK" redefined
168In file included from <command line>:1:
169./include/linux/autoconf.h:381:1: warning: this is the location of the previous definition
170  CC [M]  /home/ubuntu/openwrt/test/trunk-1/build_dir/linux-x86_generic/fuse-2.6.5/kernel/file.o
171In file included from /home/ubuntu/openwrt/test/trunk-1/build_dir/linux-x86_generic/fuse-2.6.5/kernel/file.c:9:
172/home/ubuntu/openwrt/test/trunk-1/build_dir/linux-x86_generic/fuse-2.6.5/kernel/fuse_i.h:81:1: warning: "CONFIG_BLOCK" redefined
173In file included from <command line>:1:
174./include/linux/autoconf.h:381:1: warning: this is the location of the previous definition
175/home/ubuntu/openwrt/test/trunk-1/build_dir/linux-x86_generic/fuse-2.6.5/kernel/file.c: In function 'fuse_finish_open':
176/home/ubuntu/openwrt/test/trunk-1/build_dir/linux-x86_generic/fuse-2.6.5/kernel/file.c:78: warning: 'invalidate_inode_pages' is deprecated (declared at include/linux/fs.h:1528)
177/home/ubuntu/openwrt/test/trunk-1/build_dir/linux-x86_generic/fuse-2.6.5/kernel/file.c: In function 'fuse_file_lock':
178/home/ubuntu/openwrt/test/trunk-1/build_dir/linux-x86_generic/fuse-2.6.5/kernel/file.c:785: error: wrong type argument to unary exclamation mark
179/home/ubuntu/openwrt/test/trunk-1/build_dir/linux-x86_generic/fuse-2.6.5/kernel/file.c: At top level:
180/home/ubuntu/openwrt/test/trunk-1/build_dir/linux-x86_generic/fuse-2.6.5/kernel/file.c:864: error: unknown field 'sendfile' specified in initializer
181/home/ubuntu/openwrt/test/trunk-1/build_dir/linux-x86_generic/fuse-2.6.5/kernel/file.c:864: error: 'generic_file_sendfile' undeclared here (not in a function)
182make[6]: *** [/home/ubuntu/openwrt/test/trunk-1/build_dir/linux-x86_generic/fuse-2.6.5/kernel/file.o] Error 1
183make[5]: *** [_module_/home/ubuntu/openwrt/test/trunk-1/build_dir/linux-x86_generic/fuse-2.6.5/kernel] Error 2
184make[5]: Leaving directory `/home/ubuntu/openwrt/test/trunk-1/build_dir/linux-x86_generic/linux-2.6.23'
185make[4]: *** [all-spec] Error 2
186make[4]: Leaving directory `/home/ubuntu/openwrt/test/trunk-1/build_dir/linux-x86_generic/fuse-2.6.5/kernel'
187make[3]: *** [all-recursive] Error 1
188make[3]: Leaving directory `/home/ubuntu/openwrt/test/trunk-1/build_dir/linux-x86_generic/fuse-2.6.5'
189make[2]: *** [/home/ubuntu/openwrt/test/trunk-1/build_dir/linux-x86_generic/fuse-2.6.5/.built] Error 2
190make[2]: Leaving directory `/home/ubuntu/openwrt/test/trunk-1/package/fuse'
191make[1]: *** [package/fuse/compile] Error 2
192make[1]: Leaving directory `/home/ubuntu/openwrt/test/trunk-1'
193make: *** [package/fuse-compile] Fehler 2