Ticket #2504: buildlog-dbus-glib.txt

File buildlog-dbus-glib.txt, 27.6 KB (added by anonymous, 10 years ago)
Line 
1make[1]: Entering directory `/home/ubuntu/openwrt/kamikaze_7.09_test/package'
2[33m  make[2] -C package dbus-glib-clean[m
3make[2]: Entering directory `/home/ubuntu/openwrt/kamikaze_7.09_test/feeds/packages/libs/dbus-glib'
4[33m  make[3] -C feeds/packages/libs/dbus-glib clean[m
5rm -f /home/ubuntu/openwrt/kamikaze_7.09_test/bin/packages/libdbus-glib_*
6make[2]: Leaving directory `/home/ubuntu/openwrt/kamikaze_7.09_test/feeds/packages/libs/dbus-glib'
7make[1]: Leaving directory `/home/ubuntu/openwrt/kamikaze_7.09_test/package'
8make[1]: Entering directory `/home/ubuntu/openwrt/kamikaze_7.09_test/package'
9[33m  make[2] -C package dbus-glib-compile[m
10make -j1 -C expat compile || {  echo -e ""\\033[33m"  "*** expat compile failed""\\033[m" " >&3; false; }
11make[2]: Entering directory `/home/ubuntu/openwrt/kamikaze_7.09_test/feeds/packages/libs/expat'
12[33m  make[3] -C feeds/packages/libs/expat compile[m
13make[2]: Leaving directory `/home/ubuntu/openwrt/kamikaze_7.09_test/feeds/packages/libs/expat'
14make -j1 -C dbus compile || {   echo -e ""\\033[33m"  "*** dbus compile failed""\\033[m" " >&3; false; }
15make[2]: Entering directory `/home/ubuntu/openwrt/kamikaze_7.09_test/feeds/packages/utils/dbus'
16[33m  make[3] -C feeds/packages/utils/dbus compile[m
17make[2]: Leaving directory `/home/ubuntu/openwrt/kamikaze_7.09_test/feeds/packages/utils/dbus'
18make -j1 -C libiconv compile || {       echo -e ""\\033[33m"  "*** libiconv compile failed""\\033[m" " >&3; false; }
19make[2]: Entering directory `/home/ubuntu/openwrt/kamikaze_7.09_test/feeds/packages/libs/libiconv'
20[33m  make[3] -C feeds/packages/libs/libiconv compile[m
21make[2]: Leaving directory `/home/ubuntu/openwrt/kamikaze_7.09_test/feeds/packages/libs/libiconv'
22make -j1 -C gettext compile || {        echo -e ""\\033[33m"  "*** gettext compile failed""\\033[m" " >&3; false; }
23make[2]: Entering directory `/home/ubuntu/openwrt/kamikaze_7.09_test/feeds/packages/libs/gettext'
24[33m  make[3] -C feeds/packages/libs/gettext compile[m
25make[2]: Leaving directory `/home/ubuntu/openwrt/kamikaze_7.09_test/feeds/packages/libs/gettext'
26make -j1 -C glib2 compile || {  echo -e ""\\033[33m"  "*** glib2 compile failed""\\033[m" " >&3; false; }
27make[2]: Entering directory `/home/ubuntu/openwrt/kamikaze_7.09_test/feeds/packages/libs/glib2'
28[33m  make[3] -C feeds/packages/libs/glib2 compile[m
29make[2]: Leaving directory `/home/ubuntu/openwrt/kamikaze_7.09_test/feeds/packages/libs/glib2'
30find: /home/ubuntu/openwrt/kamikaze_7.09_test/build_mipsel/dbus-glib-0.74: No such file or directory
31make[2]: Entering directory `/home/ubuntu/openwrt/kamikaze_7.09_test/feeds/packages/libs/dbus-glib'
32[33m  make[3] -C feeds/packages/libs/dbus-glib compile[m
33gzip -dc /home/ubuntu/openwrt/kamikaze_7.09_test/dl/dbus-glib-0.74.tar.gz | /bin/tar -C /home/ubuntu/openwrt/kamikaze_7.09_test/build_mipsel/dbus-glib-0.74/.. -xf -
34
35Applying ./patches/001-cross.patch using plaintext:
36patching file dbus/Makefile.in
37patching file Makefile.in
38touch /home/ubuntu/openwrt/kamikaze_7.09_test/build_mipsel/dbus-glib-0.74/.prepared_88083f27642ce8b67db5f06ae889358f
39(cd /home/ubuntu/openwrt/kamikaze_7.09_test/build_mipsel/dbus-glib-0.74/./; if [ -x ./configure ]; then cp -fpR /home/ubuntu/openwrt/kamikaze_7.09_test/scripts/config.{guess,sub} /home/ubuntu/openwrt/kamikaze_7.09_test/build_mipsel/dbus-glib-0.74// && AR=mipsel-linux-uclibc-ar AS="ccache mipsel-linux-uclibc-gcc -c -Os -pipe -mips32 -mtune=mips32 -funit-at-a-time" LD=mipsel-linux-uclibc-ld NM=mipsel-linux-uclibc-nm CC="ccache mipsel-linux-uclibc-gcc" GCC="ccache mipsel-linux-uclibc-gcc" CXX=mipsel-linux-uclibc-g++ RANLIB=mipsel-linux-uclibc-ranlib STRIP=mipsel-linux-uclibc-strip OBJCOPY=mipsel-linux-uclibc-objcopy OBJDUMP=mipsel-linux-uclibc-objdump SIZE=mipsel-linux-uclibc-size CFLAGS="-Os -pipe -mips32 -mtune=mips32 -funit-at-a-time -I/home/ubuntu/openwrt/kamikaze_7.09_test/staging_dir_mipsel/usr/include -I/home/ubuntu/openwrt/kamikaze_7.09_test/staging_dir_mipsel/include" CXXFLAGS="-Os -pipe -mips32 -mtune=mips32 -funit-at-a-time -I/home/ubuntu/openwrt/kamikaze_7.09_test/staging_dir_mipsel/usr/include -I/home/ubuntu/openwrt/kamikaze_7.09_test/staging_dir_mipsel/include" CPPFLAGS="-I/home/ubuntu/openwrt/kamikaze_7.09_test/staging_dir_mipsel/usr/include -I/home/ubuntu/openwrt/kamikaze_7.09_test/staging_dir_mipsel/include -I/home/ubuntu/openwrt/kamikaze_7.09_test/staging_dir_mipsel/usr/include -I/home/ubuntu/openwrt/kamikaze_7.09_test/staging_dir_mipsel/include" LDFLAGS="-L/home/ubuntu/openwrt/kamikaze_7.09_test/staging_dir_mipsel/usr/lib -L/home/ubuntu/openwrt/kamikaze_7.09_test/staging_dir_mipsel/lib" PKG_CONFIG_PATH="/home/ubuntu/openwrt/kamikaze_7.09_test/staging_dir_mipsel/usr/lib/pkgconfig" PKG_CONFIG_LIBDIR="/home/ubuntu/openwrt/kamikaze_7.09_test/staging_dir_mipsel/usr/lib/pkgconfig" ac_cv_func_posix_getpwnam_r="yes" ac_cv_have_abstract_sockets="yes" CPPFLAGS="$CPPFLAGS -I/home/ubuntu/openwrt/kamikaze_7.09_test/staging_dir_mipsel/usr/lib/libiconv/include" CPPFLAGS="$CPPFLAGS -I/home/ubuntu/openwrt/kamikaze_7.09_test/staging_dir_mipsel/usr/lib/libintl/include" LDFLAGS="$LDFLAGS -L/home/ubuntu/openwrt/kamikaze_7.09_test/staging_dir_mipsel/usr/lib/libiconv/lib" LDFLAGS="$LDFLAGS -L/home/ubuntu/openwrt/kamikaze_7.09_test/staging_dir_mipsel/usr/lib/libintl/lib"   ./configure --target=mipsel-linux --host=mipsel-linux --build=i486-linux-gnu --program-prefix="" --program-suffix="" --prefix=/usr --exec-prefix=/usr --bindir=/usr/bin --sbindir=/usr/sbin --libexecdir=/usr/lib --sysconfdir=/etc --datadir=/usr/share --localstatedir=/var --mandir=/usr/man --infodir=/usr/info --disable-nls --enable-shared --enable-static --disable-tests --disable-xml-docs --disable-doxygen-docs  ; fi; )
40configure: loading site script /home/ubuntu/openwrt/kamikaze_7.09_test/include/site/mipsel-linux-uclibc
41checking build system type... i486-pc-linux-gnu
42checking host system type... mipsel-unknown-linux-gnu
43checking target system type... mipsel-unknown-linux-gnu
44checking for a BSD-compatible install... /usr/bin/install -c
45checking whether build environment is sane... yes
46checking for a thread-safe mkdir -p... /bin/mkdir -p
47checking for gawk... gawk
48checking whether make sets $(MAKE)... yes
49checking for mipsel-linux-strip... mipsel-linux-uclibc-strip
50checking whether to enable maintainer-specific portions of Makefiles... no
51checking for mipsel-linux-gcc... ccache mipsel-linux-uclibc-gcc
52checking for C compiler default output file name... a.out
53checking whether the C compiler works... yes
54checking whether we are cross compiling... yes
55checking for suffix of executables...
56checking for suffix of object files... o
57checking whether we are using the GNU C compiler... yes
58checking whether ccache mipsel-linux-uclibc-gcc accepts -g... yes
59checking for ccache mipsel-linux-uclibc-gcc option to accept ISO C89... none needed
60checking for style of include used by make... GNU
61checking dependency style of ccache mipsel-linux-uclibc-gcc... gcc3
62checking whether we are using the GNU C++ compiler... yes
63checking whether mipsel-linux-uclibc-g++ accepts -g... yes
64checking dependency style of mipsel-linux-uclibc-g++... gcc3
65checking for library containing strerror... none required
66checking how to run the C preprocessor... ccache mipsel-linux-uclibc-gcc -E
67checking for grep that handles long lines and -e... /bin/grep
68checking for egrep... /bin/grep -E
69checking for ANSI C header files... yes
70checking whether gcc understands -Wfloat-equal... yes
71checking for a sed that does not truncate output... /home/ubuntu/openwrt/kamikaze_7.09_test/staging_dir_mipsel/bin/sed
72checking for ld used by ccache mipsel-linux-uclibc-gcc... mipsel-linux-uclibc-ld
73checking if the linker (mipsel-linux-uclibc-ld) is GNU ld... yes
74checking for mipsel-linux-uclibc-ld option to reload object files... -r
75checking for BSD-compatible nm... mipsel-linux-uclibc-nm
76checking whether ln -s works... yes
77checking how to recognise dependent libraries... pass_all
78checking for sys/types.h... yes
79checking for sys/stat.h... yes
80checking for stdlib.h... yes
81checking for string.h... yes
82checking for memory.h... yes
83checking for strings.h... yes
84checking for inttypes.h... yes
85checking for stdint.h... yes
86checking for unistd.h... yes
87checking dlfcn.h usability... yes
88checking dlfcn.h presence... yes
89checking for dlfcn.h... yes
90checking how to run the C++ preprocessor... mipsel-linux-uclibc-g++ -E
91checking for mipsel-linux-g77... no
92checking for mipsel-linux-xlf... no
93checking for mipsel-linux-f77... no
94checking for mipsel-linux-frt... no
95checking for mipsel-linux-pgf77... no
96checking for mipsel-linux-cf77... no
97checking for mipsel-linux-fort77... no
98checking for mipsel-linux-fl32... no
99checking for mipsel-linux-af77... no
100checking for mipsel-linux-xlf90... no
101checking for mipsel-linux-f90... no
102checking for mipsel-linux-pgf90... no
103checking for mipsel-linux-pghpf... no
104checking for mipsel-linux-epcf90... no
105checking for mipsel-linux-gfortran... no
106checking for mipsel-linux-g95... no
107checking for mipsel-linux-xlf95... no
108checking for mipsel-linux-f95... no
109checking for mipsel-linux-fort... no
110checking for mipsel-linux-ifort... no
111checking for mipsel-linux-ifc... no
112checking for mipsel-linux-efc... no
113checking for mipsel-linux-pgf95... no
114checking for mipsel-linux-lf95... no
115checking for mipsel-linux-ftn... no
116checking for g77... no
117checking for xlf... no
118checking for f77... no
119checking for frt... no
120checking for pgf77... no
121checking for cf77... no
122checking for fort77... no
123checking for fl32... no
124checking for af77... no
125checking for xlf90... no
126checking for f90... no
127checking for pgf90... no
128checking for pghpf... no
129checking for epcf90... no
130checking for gfortran... no
131checking for g95... no
132checking for xlf95... no
133checking for f95... no
134checking for fort... no
135checking for ifort... no
136checking for ifc... no
137checking for efc... no
138checking for pgf95... no
139checking for lf95... no
140checking for ftn... no
141checking whether we are using the GNU Fortran 77 compiler... no
142checking whether  accepts -g... no
143checking the maximum length of command line arguments... 32768
144checking command to parse mipsel-linux-uclibc-nm output from ccache mipsel-linux-uclibc-gcc object... ok
145checking for objdir... .libs
146checking for mipsel-linux-ar... mipsel-linux-uclibc-ar
147checking for mipsel-linux-ranlib... mipsel-linux-uclibc-ranlib
148checking for mipsel-linux-strip... (cached) mipsel-linux-uclibc-strip
149checking if ccache mipsel-linux-uclibc-gcc supports -fno-rtti -fno-exceptions... no
150checking for ccache mipsel-linux-uclibc-gcc option to produce PIC... -fPIC
151checking if ccache mipsel-linux-uclibc-gcc PIC flag -fPIC works... yes
152checking if ccache mipsel-linux-uclibc-gcc static flag -static works... yes
153checking if ccache mipsel-linux-uclibc-gcc supports -c -o file.o... yes
154checking whether the ccache mipsel-linux-uclibc-gcc linker (mipsel-linux-uclibc-ld) supports shared libraries... yes
155checking whether -lc should be explicitly linked in... no
156checking dynamic linker characteristics... cat: /etc/ld.so.conf.d/*.conf: No such file or directory
157GNU/Linux ld.so
158checking how to hardcode library paths into programs... immediate
159checking whether stripping libraries is possible... yes
160checking if libtool supports shared libraries... yes
161checking whether to build shared libraries... yes
162checking whether to build static libraries... yes
163configure: creating libtool
164appending configuration tag "CXX" to libtool
165checking for ld used by mipsel-linux-uclibc-g++... mipsel-linux-uclibc-ld
166checking if the linker (mipsel-linux-uclibc-ld) is GNU ld... yes
167checking whether the mipsel-linux-uclibc-g++ linker (mipsel-linux-uclibc-ld) supports shared libraries... yes
168checking for mipsel-linux-uclibc-g++ option to produce PIC... -fPIC
169checking if mipsel-linux-uclibc-g++ PIC flag -fPIC works... yes
170checking if mipsel-linux-uclibc-g++ static flag -static works... yes
171checking if mipsel-linux-uclibc-g++ supports -c -o file.o... yes
172checking whether the mipsel-linux-uclibc-g++ linker (mipsel-linux-uclibc-ld) supports shared libraries... yes
173checking dynamic linker characteristics... cat: /etc/ld.so.conf.d/*.conf: No such file or directory
174GNU/Linux ld.so
175checking how to hardcode library paths into programs... immediate
176appending configuration tag "F77" to libtool
177checking for char... yes
178checking size of char... (cached) 1
179checking for short... yes
180checking size of short... (cached) 2
181checking for long... yes
182checking size of long... (cached) 4
183checking for int... yes
184checking size of int... (cached) 4
185checking for void *... yes
186checking size of void *... (cached) 4
187checking for long long... yes
188checking size of long long... (cached) 8
189checking for __int64... no
190checking size of __int64... (cached) 0
191checking 64-bit integer type... long long
192checking 32-bit integer type... int
193checking 16-bit integer type... short
194checking whether byte ordering is bigendian... (cached) no
195checking for an implementation of va_copy()... yes
196checking for an implementation of __va_copy()... yes
197checking whether va_lists can be copied by value... yes
198checking whether to use inline assembler routines for atomic integers... no
199checking for socket in -lsocket... no
200checking for gethostbyname in -lnsl... yes
201checking for vsnprintf... (cached) yes
202checking for vasprintf... yes
203checking for nanosleep... yes
204checking for usleep... yes
205checking for poll... yes
206checking for setenv... yes
207checking for unsetenv... yes
208checking for socketpair... yes
209checking for getgrouplist... no
210checking execinfo.h usability... no
211checking execinfo.h presence... no
212checking for execinfo.h... no
213checking for posix getpwnam_r... (cached) yes
214checking whether socklen_t is defined... yes
215checking sys/uio.h usability... yes
216checking sys/uio.h presence... yes
217checking for sys/uio.h... yes
218checking for writev... yes
219checking for ISO C99 varargs macros in C... yes
220checking for GNUC varargs macros... yes
221checking for struct cmsgcred... no
222checking for getpeerucred... no
223checking for getpeereid... no
224checking abstract socket namespace... (cached) yes
225checking locale.h usability... yes
226checking locale.h presence... yes
227checking for locale.h... yes
228checking for LC_MESSAGES... yes
229checking libintl.h usability... yes
230checking libintl.h presence... yes
231checking for libintl.h... yes
232checking for ngettext in libc... no
233checking for bindtextdomain in -lintl... yes
234checking for ngettext in -lintl... yes
235checking for dgettext in -lintl... yes
236checking for bind_textdomain_codeset... yes
237checking for msgfmt... /usr/bin/msgfmt
238checking for dcgettext... yes
239checking if msgfmt accepts -c... yes
240checking for gmsgfmt... /usr/bin/msgfmt
241checking for xgettext... /usr/bin/xgettext
242./configure: line 26052: ./po/POTFILES.in: No such file or directory
243checking for XML_ParserCreate_MM in -lexpat... yes
244checking expat.h usability... yes
245checking expat.h presence... yes
246checking for expat.h... yes
247checking for mipsel-linux-pkg-config... no
248checking for pkg-config... /usr/bin/pkg-config
249configure: WARNING: In the future, Autoconf will not detect cross-tools
250whose name does not start with the host triplet.  If you think this
251configuration is useful to you, please write to autoconf@gnu.org.
252checking pkg-config is at least version 0.9.0... yes
253checking for DBUS... yes
254checking for DBUS_GLIB... yes
255checking for DBUS_GLIB_THREADS... yes
256checking for doxygen... no
257checking whether to build Doxygen documentation... yes
258configure: creating ./config.status
259config.status: creating Makefile
260config.status: creating m4/Makefile
261config.status: creating doc/Makefile
262config.status: creating doc/reference/Makefile
263config.status: creating doc/reference/version.xml
264config.status: creating dbus/Makefile
265config.status: creating dbus/examples/Makefile
266config.status: creating dbus/examples/statemachine/Makefile
267config.status: creating test/Makefile
268config.status: creating test/core/Makefile
269config.status: creating test/interfaces/Makefile
270config.status: creating test/data/valid-service-files/debug-glib.service
271config.status: creating test/data/valid-service-files/debug-echo.service
272config.status: creating test/data/valid-service-files/interfaces-test.service
273config.status: creating tools/Makefile
274config.status: creating dbus-glib-1.pc
275config.status: creating dbus-glib-1-uninstalled.pc
276config.status: creating Doxyfile
277config.status: creating config.h
278config.status: executing depfiles commands
279config.status: executing default-1 commands
280
281                    D-BUS GLIB BINDINGS 0.74
282                  ==============
283
284        prefix:                   /usr
285        exec_prefix:              /usr
286        libdir:                   /usr/lib
287        bindir:                   /usr/bin
288        sysconfdir:               /etc
289        localstatedir:            /var
290        datadir:                  /usr/share
291        source code location:     .
292        compiler:                 ccache mipsel-linux-uclibc-gcc
293        cflags:                   -Os -pipe -mips32 -mtune=mips32 -funit-at-a-time -I/home/ubuntu/openwrt/kamikaze_7.09_test/staging_dir_mipsel/usr/include -I/home/ubuntu/openwrt/kamikaze_7.09_test/staging_dir_mipsel/include -Wall -Wchar-subscripts -Wmissing-declarations -Wmissing-prototypes -Wnested-externs -Wpointer-arith -Wcast-align -Wfloat-equal -Wsign-compare
294        cppflags:                 -DDBUS_API_SUBJECT_TO_CHANGE=1 -I/home/ubuntu/openwrt/kamikaze_7.09_test/staging_dir_mipsel/usr/include -I/home/ubuntu/openwrt/kamikaze_7.09_test/staging_dir_mipsel/include -I/home/ubuntu/openwrt/kamikaze_7.09_test/staging_dir_mipsel/usr/include -I/home/ubuntu/openwrt/kamikaze_7.09_test/staging_dir_mipsel/include -I/home/ubuntu/openwrt/kamikaze_7.09_test/staging_dir_mipsel/usr/lib/libiconv/include -I/home/ubuntu/openwrt/kamikaze_7.09_test/staging_dir_mipsel/usr/lib/libintl/include
295        cxxflags:                 -Os -pipe -mips32 -mtune=mips32 -funit-at-a-time -I/home/ubuntu/openwrt/kamikaze_7.09_test/staging_dir_mipsel/usr/include -I/home/ubuntu/openwrt/kamikaze_7.09_test/staging_dir_mipsel/include
296        64-bit int:               long long
297        32-bit int:               int
298        16-bit int:               short
299        Doxygen:                  no
300
301        Maintainer mode:          no
302        gcc coverage profiling:   no
303        Building unit tests:      no
304        Building verbose mode:    no
305        Building assertions:      no
306        Building checks:          yes
307        Building Doxygen docs:    no
308        Building Gtk-doc docs:    no
309        Gettext libs (empty OK):  -lintl
310        Using XML parser:         
311        'make check' socket dir: 
312
313touch /home/ubuntu/openwrt/kamikaze_7.09_test/build_mipsel/dbus-glib-0.74/.configured
314make -C /home/ubuntu/openwrt/kamikaze_7.09_test/build_mipsel/dbus-glib-0.74 DESTDIR="/home/ubuntu/openwrt/kamikaze_7.09_test/build_mipsel/dbus-glib-0.74/ipkg-install" all install
315make[3]: Entering directory `/home/ubuntu/openwrt/kamikaze_7.09_test/build_mipsel/dbus-glib-0.74'
316make  all-recursive
317make[4]: Entering directory `/home/ubuntu/openwrt/kamikaze_7.09_test/build_mipsel/dbus-glib-0.74'
318Making all in dbus
319make[5]: Entering directory `/home/ubuntu/openwrt/kamikaze_7.09_test/build_mipsel/dbus-glib-0.74/dbus'
320make  all-recursive
321make[6]: Entering directory `/home/ubuntu/openwrt/kamikaze_7.09_test/build_mipsel/dbus-glib-0.74/dbus'
322Making all in .
323make[7]: Entering directory `/home/ubuntu/openwrt/kamikaze_7.09_test/build_mipsel/dbus-glib-0.74/dbus'
324/bin/sh ../libtool --tag=CC   --mode=compile ccache mipsel-linux-uclibc-gcc -DHAVE_CONFIG_H -I. -I.. -I.. -I.. -I/usr/include/dbus-1.0 -I/usr/lib/dbus-1.0/include   -I/usr/include/glib-2.0 -I/usr/lib/glib-2.0/include    -DDBUS_COMPILATION=1 -DDBUS_LOCALEDIR=\"/usr/share/locale\"   -DDBUS_API_SUBJECT_TO_CHANGE=1 -I/home/ubuntu/openwrt/kamikaze_7.09_test/staging_dir_mipsel/usr/include -I/home/ubuntu/openwrt/kamikaze_7.09_test/staging_dir_mipsel/include -I/home/ubuntu/openwrt/kamikaze_7.09_test/staging_dir_mipsel/usr/include -I/home/ubuntu/openwrt/kamikaze_7.09_test/staging_dir_mipsel/include -I/home/ubuntu/openwrt/kamikaze_7.09_test/staging_dir_mipsel/usr/lib/libiconv/include -I/home/ubuntu/openwrt/kamikaze_7.09_test/staging_dir_mipsel/usr/lib/libintl/include  -Os -pipe -mips32 -mtune=mips32 -funit-at-a-time -I/home/ubuntu/openwrt/kamikaze_7.09_test/staging_dir_mipsel/usr/include -I/home/ubuntu/openwrt/kamikaze_7.09_test/staging_dir_mipsel/include -Wall -Wchar-subscripts -Wmissing-declarations -Wmissing-prototypes -Wnested-externs -Wpointer-arith -Wcast-align -Wfloat-equal -Wsign-compare -MT dbus-glib.lo -MD -MP -MF .deps/dbus-glib.Tpo -c -o dbus-glib.lo dbus-glib.c
325mkdir .libs
326 ccache mipsel-linux-uclibc-gcc -DHAVE_CONFIG_H -I. -I.. -I.. -I.. -I/usr/include/dbus-1.0 -I/usr/lib/dbus-1.0/include -I/usr/include/glib-2.0 -I/usr/lib/glib-2.0/include -DDBUS_COMPILATION=1 -DDBUS_LOCALEDIR=\"/usr/share/locale\" -DDBUS_API_SUBJECT_TO_CHANGE=1 -I/home/ubuntu/openwrt/kamikaze_7.09_test/staging_dir_mipsel/usr/include -I/home/ubuntu/openwrt/kamikaze_7.09_test/staging_dir_mipsel/include -I/home/ubuntu/openwrt/kamikaze_7.09_test/staging_dir_mipsel/usr/include -I/home/ubuntu/openwrt/kamikaze_7.09_test/staging_dir_mipsel/include -I/home/ubuntu/openwrt/kamikaze_7.09_test/staging_dir_mipsel/usr/lib/libiconv/include -I/home/ubuntu/openwrt/kamikaze_7.09_test/staging_dir_mipsel/usr/lib/libintl/include -Os -pipe -mips32 -mtune=mips32 -funit-at-a-time -I/home/ubuntu/openwrt/kamikaze_7.09_test/staging_dir_mipsel/usr/include -I/home/ubuntu/openwrt/kamikaze_7.09_test/staging_dir_mipsel/include -Wall -Wchar-subscripts -Wmissing-declarations -Wmissing-prototypes -Wnested-externs -Wpointer-arith -Wcast-align -Wfloat-equal -Wsign-compare -MT dbus-glib.lo -MD -MP -MF .deps/dbus-glib.Tpo -c dbus-glib.c  -fPIC -DPIC -o .libs/dbus-glib.o
327In file included from dbus-glib.c:25:
328dbus-glib.h:28:30: dbus/dbus-shared.h: No such file or directory
329In file included from dbus-glib.c:25:
330dbus-glib.h:74: error: syntax error before "type"
331In file included from dbus-glib.c:26:
332dbus-glib-lowlevel.h:28:23: dbus/dbus.h: No such file or directory
333In file included from dbus-glib.c:26:
334dbus-glib-lowlevel.h:33: error: syntax error before "DBusError"
335dbus-glib-lowlevel.h:42: error: syntax error before '*' token
336dbus-glib-lowlevel.h:44: error: syntax error before '*' token
337dbus-glib-lowlevel.h:48: error: syntax error before "DBusMessage"
338dbus-glib-lowlevel.h:51: error: syntax error before '*' token
339dbus-glib-lowlevel.h:51: warning: type defaults to `int' in declaration of `dbus_g_connection_get_connection'
340dbus-glib-lowlevel.h:51: warning: data definition has no type or storage class
341dbus-glib-lowlevel.h:52: error: syntax error before '*' token
342dbus-glib-lowlevel.h:53: error: syntax error before '*' token
343dbus-glib-lowlevel.h:53: warning: type defaults to `int' in declaration of `dbus_g_message_get_message'
344dbus-glib-lowlevel.h:53: warning: data definition has no type or storage class
345dbus-glib-lowlevel.h:63: error: syntax error before '*' token
346dbus-glib-lowlevel.h:63: warning: type defaults to `int' in declaration of `dbus_g_method_get_reply'
347dbus-glib-lowlevel.h:63: warning: data definition has no type or storage class
348dbus-glib-lowlevel.h:66: error: syntax error before "DBusMessage"
349In file included from dbus-glib.c:29:
350dbus-gobject.h:27:33: dbus/dbus-signature.h: No such file or directory
351dbus-glib.c: In function `dbus_g_connection_flush':
352dbus-glib.c:55: warning: implicit declaration of function `dbus_connection_flush'
353dbus-glib.c:55: warning: nested extern declaration of `dbus_connection_flush'
354dbus-glib.c:55: error: `DBusConnection' undeclared (first use in this function)
355dbus-glib.c:55: error: (Each undeclared identifier is reported only once
356dbus-glib.c:55: error: for each function it appears in.)
357dbus-glib.c:55: error: syntax error before ')' token
358dbus-glib.c: In function `dbus_g_connection_ref':
359dbus-glib.c:69: error: `DBusConnection' undeclared (first use in this function)
360dbus-glib.c:69: error: `c' undeclared (first use in this function)
361dbus-glib.c:71: error: syntax error before ')' token
362dbus-glib.c:72: warning: implicit declaration of function `dbus_connection_ref'
363dbus-glib.c:72: warning: nested extern declaration of `dbus_connection_ref'
364dbus-glib.c: In function `dbus_g_connection_unref':
365dbus-glib.c:86: error: `DBusConnection' undeclared (first use in this function)
366dbus-glib.c:86: error: `c' undeclared (first use in this function)
367dbus-glib.c:88: error: syntax error before ')' token
368dbus-glib.c:89: warning: implicit declaration of function `dbus_connection_unref'
369dbus-glib.c:89: warning: nested extern declaration of `dbus_connection_unref'
370dbus-glib.c: In function `dbus_g_message_ref':
371dbus-glib.c:113: error: `DBusMessage' undeclared (first use in this function)
372dbus-glib.c:113: error: `c' undeclared (first use in this function)
373dbus-glib.c:115: error: syntax error before ')' token
374dbus-glib.c:116: warning: implicit declaration of function `dbus_message_ref'
375dbus-glib.c:116: warning: nested extern declaration of `dbus_message_ref'
376dbus-glib.c: In function `dbus_g_message_unref':
377dbus-glib.c:129: error: `DBusMessage' undeclared (first use in this function)
378dbus-glib.c:129: error: `c' undeclared (first use in this function)
379dbus-glib.c:131: error: syntax error before ')' token
380dbus-glib.c:132: warning: implicit declaration of function `dbus_message_unref'
381dbus-glib.c:132: warning: nested extern declaration of `dbus_message_unref'
382dbus-glib.c: In function `dbus_connection_get_g_type':
383dbus-glib.c:225: error: `dbus_connection_ref' undeclared (first use in this function)
384dbus-glib.c:226: error: `dbus_connection_unref' undeclared (first use in this function)
385dbus-glib.c: In function `dbus_message_get_g_type':
386dbus-glib.c:244: error: `dbus_message_ref' undeclared (first use in this function)
387dbus-glib.c:245: error: `dbus_message_unref' undeclared (first use in this function)
388dbus-glib.c: At top level:
389dbus-glib.c:305: error: syntax error before '*' token
390dbus-glib.c:307: warning: return type defaults to `int'
391dbus-glib.c: In function `dbus_g_connection_get_connection':
392dbus-glib.c:309: error: `DBusConnection' undeclared (first use in this function)
393dbus-glib.c:309: error: syntax error before ')' token
394dbus-glib.c: At top level:
395dbus-glib.c:312: error: syntax error before "_dbus_gmain_connection_slot"
396dbus-glib.c:312: warning: type defaults to `int' in declaration of `_dbus_gmain_connection_slot'
397dbus-glib.c:312: warning: data definition has no type or storage class
398dbus-glib.c:326: error: syntax error before '*' token
399dbus-glib.c:327: warning: no previous prototype for 'dbus_connection_get_g_connection'
400dbus-glib.c: In function `dbus_connection_get_g_connection':
401dbus-glib.c:328: error: `connection' undeclared (first use in this function)
402dbus-glib.c:329: warning: implicit declaration of function `dbus_connection_get_data'
403dbus-glib.c:329: warning: nested extern declaration of `dbus_connection_get_data'
404dbus-glib.c: At top level:
405dbus-glib.c:344: error: syntax error before '*' token
406dbus-glib.c:346: warning: return type defaults to `int'
407dbus-glib.c: In function `dbus_g_message_get_message':
408dbus-glib.c:347: error: `DBusMessage' undeclared (first use in this function)
409dbus-glib.c:347: error: syntax error before ')' token
410make[7]: *** [dbus-glib.lo] Error 1
411make[7]: Leaving directory `/home/ubuntu/openwrt/kamikaze_7.09_test/build_mipsel/dbus-glib-0.74/dbus'
412make[6]: *** [all-recursive] Error 1
413make[6]: Leaving directory `/home/ubuntu/openwrt/kamikaze_7.09_test/build_mipsel/dbus-glib-0.74/dbus'
414make[5]: *** [all] Error 2
415make[5]: Leaving directory `/home/ubuntu/openwrt/kamikaze_7.09_test/build_mipsel/dbus-glib-0.74/dbus'
416make[4]: *** [all-recursive] Error 1
417make[4]: Leaving directory `/home/ubuntu/openwrt/kamikaze_7.09_test/build_mipsel/dbus-glib-0.74'
418make[3]: *** [all] Error 2
419make[3]: Leaving directory `/home/ubuntu/openwrt/kamikaze_7.09_test/build_mipsel/dbus-glib-0.74'
420make[2]: *** [/home/ubuntu/openwrt/kamikaze_7.09_test/build_mipsel/dbus-glib-0.74/.built] Error 2
421make[2]: Leaving directory `/home/ubuntu/openwrt/kamikaze_7.09_test/feeds/packages/libs/dbus-glib'
422[33m  *** dbus-glib compile failed[m
423make[1]: *** [dbus-glib-compile] Error 1
424make[1]: Leaving directory `/home/ubuntu/openwrt/kamikaze_7.09_test/package'
425Build failed. Please re-run make with V=99 to see what's going on
426make: *** [package/dbus-glib-compile] Fehler 1