Ticket #11876: uboot-image_h-build_error.txt

File uboot-image_h-build_error.txt, 19.2 KB (added by c.exe@…, 6 years ago)

U-Boot image.h build bug console output

Line 
1make[1]: Entering directory `/build/horstbox/pro/herta/openwrt.svn'
2make[2]: Entering directory `/build/horstbox/pro/herta/openwrt.svn'
3+ mkdir -p /build/horstbox/pro/herta/openwrt.svn/staging_dir/target-mipsel-openwrt-linux-uclibc
4+ cd /build/horstbox/pro/herta/openwrt.svn/staging_dir/target-mipsel-openwrt-linux-uclibc
5+ mkdir -p bin lib include stamp
6mkdir -p /build/horstbox/pro/herta/openwrt.svn/build_dir/target-mipsel-openwrt-linux-uclibc/stamp
7touch /build/horstbox/pro/herta/openwrt.svn/staging_dir/target-mipsel-openwrt-linux-uclibc/.prepared
8+ mkdir -p /build/horstbox/pro/herta/openwrt.svn/staging_dir/host
9+ cd /build/horstbox/pro/herta/openwrt.svn/staging_dir/host
10+ mkdir -p bin lib include stamp
11mkdir -p /build/horstbox/pro/herta/openwrt.svn/build_dir/host/stamp /build/horstbox/pro/herta/openwrt.svn/staging_dir/host/include/sys
12install -m0644 /build/horstbox/pro/herta/openwrt.svn/tools/include/*.h /build/horstbox/pro/herta/openwrt.svn/staging_dir/host/include/
13install -m0644 /build/horstbox/pro/herta/openwrt.svn/tools/include/sys/*.h /build/horstbox/pro/herta/openwrt.svn/staging_dir/host/include/sys/
14ln -sf lib /build/horstbox/pro/herta/openwrt.svn/staging_dir/host/lib64
15touch /build/horstbox/pro/herta/openwrt.svn/staging_dir/host/.prepared
16make[3]: Entering directory `/build/horstbox/pro/herta/openwrt.svn/tools/m4'
17make[3]: Leaving directory `/build/horstbox/pro/herta/openwrt.svn/tools/m4'
18make[3]: Entering directory `/build/horstbox/pro/herta/openwrt.svn/tools/m4'
19make[3]: Leaving directory `/build/horstbox/pro/herta/openwrt.svn/tools/m4'
20make[3]: Entering directory `/build/horstbox/pro/herta/openwrt.svn/tools/sed'
21make[3]: Leaving directory `/build/horstbox/pro/herta/openwrt.svn/tools/sed'
22make[3]: Entering directory `/build/horstbox/pro/herta/openwrt.svn/tools/sed'
23make[3]: Leaving directory `/build/horstbox/pro/herta/openwrt.svn/tools/sed'
24make[3]: Entering directory `/build/horstbox/pro/herta/openwrt.svn/tools/libtool'
25make[3]: Leaving directory `/build/horstbox/pro/herta/openwrt.svn/tools/libtool'
26make[3]: Entering directory `/build/horstbox/pro/herta/openwrt.svn/tools/libtool'
27make[3]: Leaving directory `/build/horstbox/pro/herta/openwrt.svn/tools/libtool'
28make[3]: Entering directory `/build/horstbox/pro/herta/openwrt.svn/tools/autoconf'
29make[3]: Leaving directory `/build/horstbox/pro/herta/openwrt.svn/tools/autoconf'
30make[3]: Entering directory `/build/horstbox/pro/herta/openwrt.svn/tools/autoconf'
31make[3]: Leaving directory `/build/horstbox/pro/herta/openwrt.svn/tools/autoconf'
32make[3]: Entering directory `/build/horstbox/pro/herta/openwrt.svn/tools/pkg-config'
33make[3]: Leaving directory `/build/horstbox/pro/herta/openwrt.svn/tools/pkg-config'
34make[3]: Entering directory `/build/horstbox/pro/herta/openwrt.svn/tools/pkg-config'
35make[3]: Leaving directory `/build/horstbox/pro/herta/openwrt.svn/tools/pkg-config'
36make[3]: Entering directory `/build/horstbox/pro/herta/openwrt.svn/tools/xz'
37make[3]: Leaving directory `/build/horstbox/pro/herta/openwrt.svn/tools/xz'
38make[3]: Entering directory `/build/horstbox/pro/herta/openwrt.svn/tools/xz'
39make[3]: Leaving directory `/build/horstbox/pro/herta/openwrt.svn/tools/xz'
40make[3]: Entering directory `/build/horstbox/pro/herta/openwrt.svn/tools/automake'
41make[3]: Leaving directory `/build/horstbox/pro/herta/openwrt.svn/tools/automake'
42make[3]: Entering directory `/build/horstbox/pro/herta/openwrt.svn/tools/automake'
43make[3]: Leaving directory `/build/horstbox/pro/herta/openwrt.svn/tools/automake'
44make[3]: Entering directory `/build/horstbox/pro/herta/openwrt.svn/tools/flex'
45make[3]: Leaving directory `/build/horstbox/pro/herta/openwrt.svn/tools/flex'
46make[3]: Entering directory `/build/horstbox/pro/herta/openwrt.svn/tools/flex'
47make[3]: Leaving directory `/build/horstbox/pro/herta/openwrt.svn/tools/flex'
48make[3]: Entering directory `/build/horstbox/pro/herta/openwrt.svn/tools/bison'
49make[3]: Leaving directory `/build/horstbox/pro/herta/openwrt.svn/tools/bison'
50make[3]: Entering directory `/build/horstbox/pro/herta/openwrt.svn/tools/bison'
51make[3]: Leaving directory `/build/horstbox/pro/herta/openwrt.svn/tools/bison'
52make[3]: Entering directory `/build/horstbox/pro/herta/openwrt.svn/tools/mklibs'
53make[3]: Leaving directory `/build/horstbox/pro/herta/openwrt.svn/tools/mklibs'
54make[3]: Entering directory `/build/horstbox/pro/herta/openwrt.svn/tools/mklibs'
55make[3]: Leaving directory `/build/horstbox/pro/herta/openwrt.svn/tools/mklibs'
56make[3]: Entering directory `/build/horstbox/pro/herta/openwrt.svn/tools/sstrip'
57make[3]: Leaving directory `/build/horstbox/pro/herta/openwrt.svn/tools/sstrip'
58make[3]: Entering directory `/build/horstbox/pro/herta/openwrt.svn/tools/sstrip'
59make[3]: Leaving directory `/build/horstbox/pro/herta/openwrt.svn/tools/sstrip'
60make[3]: Entering directory `/build/horstbox/pro/herta/openwrt.svn/tools/ipkg-utils'
61make[3]: Leaving directory `/build/horstbox/pro/herta/openwrt.svn/tools/ipkg-utils'
62make[3]: Entering directory `/build/horstbox/pro/herta/openwrt.svn/tools/ipkg-utils'
63make[3]: Leaving directory `/build/horstbox/pro/herta/openwrt.svn/tools/ipkg-utils'
64make[3]: Entering directory `/build/horstbox/pro/herta/openwrt.svn/tools/genext2fs'
65make[3]: Leaving directory `/build/horstbox/pro/herta/openwrt.svn/tools/genext2fs'
66make[3]: Entering directory `/build/horstbox/pro/herta/openwrt.svn/tools/genext2fs'
67make[3]: Leaving directory `/build/horstbox/pro/herta/openwrt.svn/tools/genext2fs'
68make[3]: Entering directory `/build/horstbox/pro/herta/openwrt.svn/tools/e2fsprogs'
69make[3]: Leaving directory `/build/horstbox/pro/herta/openwrt.svn/tools/e2fsprogs'
70make[3]: Entering directory `/build/horstbox/pro/herta/openwrt.svn/tools/e2fsprogs'
71make[3]: Leaving directory `/build/horstbox/pro/herta/openwrt.svn/tools/e2fsprogs'
72make[3]: Entering directory `/build/horstbox/pro/herta/openwrt.svn/tools/mtd-utils'
73make[3]: Leaving directory `/build/horstbox/pro/herta/openwrt.svn/tools/mtd-utils'
74make[3]: Entering directory `/build/horstbox/pro/herta/openwrt.svn/tools/mtd-utils'
75make[3]: Leaving directory `/build/horstbox/pro/herta/openwrt.svn/tools/mtd-utils'
76make[3]: Entering directory `/build/horstbox/pro/herta/openwrt.svn/tools/mkimage'
77rm -f /build/horstbox/pro/herta/openwrt.svn/build_dir/host/u-boot-2012.04.01/tools/.depend
78touch /build/horstbox/pro/herta/openwrt.svn/build_dir/host/u-boot-2012.04.01/include/config.h
79make -C /build/horstbox/pro/herta/openwrt.svn/build_dir/host/u-boot-2012.04.01 BUILD_DIR= BIN_FILES-y="mkimage" tools
80make[4]: Entering directory `/build/horstbox/pro/herta/openwrt.svn/build_dir/host/u-boot-2012.04.01'
81make -C tools all
82make[5]: Entering directory `/build/horstbox/pro/herta/openwrt.svn/build_dir/host/u-boot-2012.04.01/tools'
83cat /dev/null  >.depend
84make[5]: Leaving directory `/build/horstbox/pro/herta/openwrt.svn/build_dir/host/u-boot-2012.04.01/tools'
85make[5]: Entering directory `/build/horstbox/pro/herta/openwrt.svn/build_dir/host/u-boot-2012.04.01/tools'
86gcc -Wall -Wstrict-prototypes -O2 -fomit-frame-pointer -idirafter /build/horstbox/pro/herta/openwrt.svn/build_dir/host/u-boot-2012.04.01/include -idirafter /build/horstbox/pro/herta/openwrt.svn/build_dir/host/u-boot-2012.04.01/include2 -idirafter /build/horstbox/pro/herta/openwrt.svn/build_dir/host/u-boot-2012.04.01/include -I /build/horstbox/pro/herta/openwrt.svn/build_dir/host/u-boot-2012.04.01/lib/libfdt -I /build/horstbox/pro/herta/openwrt.svn/build_dir/host/u-boot-2012.04.01/tools -DCONFIG_SYS_TEXT_BASE= -DUSE_HOSTCC -D__KERNEL_STRICT_NAMES   -o aisimage.o aisimage.c -c
87In file included from /usr/include/image.h:22:0,
88                 from aisimage.c:29:
89/usr/include/rgbpixel.h:61:3: error: expected specifier-qualifier-list before 'RGBpixel'
90In file included from aisimage.c:29:0:
91/usr/include/image.h:40:1: error: unknown type name 'class'
92/usr/include/image.h:41:1: error: expected '=', ',', ';', 'asm' or '__attribute__' before '{' token
93aisimage.c:42:1: error: unknown type name 'table_entry_t'
94aisimage.c:43:2: warning: braces around scalar initializer [enabled by default]
95aisimage.c:43:2: warning: (near initialization for 'aisimage_cmds[0]') [enabled by default]
96aisimage.c:43:2: warning: excess elements in scalar initializer [enabled by default]
97aisimage.c:43:2: warning: (near initialization for 'aisimage_cmds[0]') [enabled by default]
98aisimage.c:43:2: warning: excess elements in scalar initializer [enabled by default]
99aisimage.c:43:2: warning: (near initialization for 'aisimage_cmds[0]') [enabled by default]
100aisimage.c:44:2: warning: braces around scalar initializer [enabled by default]
101aisimage.c:44:2: warning: (near initialization for 'aisimage_cmds[1]') [enabled by default]
102aisimage.c:44:2: warning: excess elements in scalar initializer [enabled by default]
103aisimage.c:44:2: warning: (near initialization for 'aisimage_cmds[1]') [enabled by default]
104aisimage.c:44:2: warning: excess elements in scalar initializer [enabled by default]
105aisimage.c:44:2: warning: (near initialization for 'aisimage_cmds[1]') [enabled by default]
106aisimage.c:45:2: warning: braces around scalar initializer [enabled by default]
107aisimage.c:45:2: warning: (near initialization for 'aisimage_cmds[2]') [enabled by default]
108aisimage.c:45:2: warning: excess elements in scalar initializer [enabled by default]
109aisimage.c:45:2: warning: (near initialization for 'aisimage_cmds[2]') [enabled by default]
110aisimage.c:45:2: warning: excess elements in scalar initializer [enabled by default]
111aisimage.c:45:2: warning: (near initialization for 'aisimage_cmds[2]') [enabled by default]
112aisimage.c:46:2: warning: braces around scalar initializer [enabled by default]
113aisimage.c:46:2: warning: (near initialization for 'aisimage_cmds[3]') [enabled by default]
114aisimage.c:46:2: warning: excess elements in scalar initializer [enabled by default]
115aisimage.c:46:2: warning: (near initialization for 'aisimage_cmds[3]') [enabled by default]
116aisimage.c:46:2: warning: excess elements in scalar initializer [enabled by default]
117aisimage.c:46:2: warning: (near initialization for 'aisimage_cmds[3]') [enabled by default]
118aisimage.c:47:2: warning: braces around scalar initializer [enabled by default]
119aisimage.c:47:2: warning: (near initialization for 'aisimage_cmds[4]') [enabled by default]
120aisimage.c:47:2: warning: excess elements in scalar initializer [enabled by default]
121aisimage.c:47:2: warning: (near initialization for 'aisimage_cmds[4]') [enabled by default]
122aisimage.c:47:2: warning: excess elements in scalar initializer [enabled by default]
123aisimage.c:47:2: warning: (near initialization for 'aisimage_cmds[4]') [enabled by default]
124aisimage.c:48:2: warning: braces around scalar initializer [enabled by default]
125aisimage.c:48:2: warning: (near initialization for 'aisimage_cmds[5]') [enabled by default]
126aisimage.c:48:2: warning: excess elements in scalar initializer [enabled by default]
127aisimage.c:48:2: warning: (near initialization for 'aisimage_cmds[5]') [enabled by default]
128aisimage.c:48:2: warning: excess elements in scalar initializer [enabled by default]
129aisimage.c:48:2: warning: (near initialization for 'aisimage_cmds[5]') [enabled by default]
130aisimage.c:49:2: warning: braces around scalar initializer [enabled by default]
131aisimage.c:49:2: warning: (near initialization for 'aisimage_cmds[6]') [enabled by default]
132aisimage.c:49:2: warning: excess elements in scalar initializer [enabled by default]
133aisimage.c:49:2: warning: (near initialization for 'aisimage_cmds[6]') [enabled by default]
134aisimage.c:49:2: warning: excess elements in scalar initializer [enabled by default]
135aisimage.c:49:2: warning: (near initialization for 'aisimage_cmds[6]') [enabled by default]
136aisimage.c:50:2: warning: braces around scalar initializer [enabled by default]
137aisimage.c:50:2: warning: (near initialization for 'aisimage_cmds[7]') [enabled by default]
138aisimage.c:50:2: warning: excess elements in scalar initializer [enabled by default]
139aisimage.c:50:2: warning: (near initialization for 'aisimage_cmds[7]') [enabled by default]
140aisimage.c:50:2: warning: excess elements in scalar initializer [enabled by default]
141aisimage.c:50:2: warning: (near initialization for 'aisimage_cmds[7]') [enabled by default]
142aisimage.c:51:2: warning: braces around scalar initializer [enabled by default]
143aisimage.c:51:2: warning: (near initialization for 'aisimage_cmds[8]') [enabled by default]
144aisimage.c:51:2: warning: excess elements in scalar initializer [enabled by default]
145aisimage.c:51:2: warning: (near initialization for 'aisimage_cmds[8]') [enabled by default]
146aisimage.c:51:2: warning: excess elements in scalar initializer [enabled by default]
147aisimage.c:51:2: warning: (near initialization for 'aisimage_cmds[8]') [enabled by default]
148aisimage.c:52:2: warning: braces around scalar initializer [enabled by default]
149aisimage.c:52:2: warning: (near initialization for 'aisimage_cmds[9]') [enabled by default]
150aisimage.c:52:2: warning: excess elements in scalar initializer [enabled by default]
151aisimage.c:52:2: warning: (near initialization for 'aisimage_cmds[9]') [enabled by default]
152aisimage.c:52:2: warning: excess elements in scalar initializer [enabled by default]
153aisimage.c:52:2: warning: (near initialization for 'aisimage_cmds[9]') [enabled by default]
154aisimage.c:53:2: warning: braces around scalar initializer [enabled by default]
155aisimage.c:53:2: warning: (near initialization for 'aisimage_cmds[10]') [enabled by default]
156aisimage.c:53:2: warning: excess elements in scalar initializer [enabled by default]
157aisimage.c:53:2: warning: (near initialization for 'aisimage_cmds[10]') [enabled by default]
158aisimage.c:53:2: warning: excess elements in scalar initializer [enabled by default]
159aisimage.c:53:2: warning: (near initialization for 'aisimage_cmds[10]') [enabled by default]
160aisimage.c:54:2: warning: braces around scalar initializer [enabled by default]
161aisimage.c:54:2: warning: (near initialization for 'aisimage_cmds[11]') [enabled by default]
162aisimage.c:54:2: warning: excess elements in scalar initializer [enabled by default]
163aisimage.c:54:2: warning: (near initialization for 'aisimage_cmds[11]') [enabled by default]
164aisimage.c:54:2: warning: excess elements in scalar initializer [enabled by default]
165aisimage.c:54:2: warning: (near initialization for 'aisimage_cmds[11]') [enabled by default]
166aisimage.c:55:2: warning: braces around scalar initializer [enabled by default]
167aisimage.c:55:2: warning: (near initialization for 'aisimage_cmds[12]') [enabled by default]
168aisimage.c:55:2: warning: excess elements in scalar initializer [enabled by default]
169aisimage.c:55:2: warning: (near initialization for 'aisimage_cmds[12]') [enabled by default]
170aisimage.c:55:2: warning: excess elements in scalar initializer [enabled by default]
171aisimage.c:55:2: warning: (near initialization for 'aisimage_cmds[12]') [enabled by default]
172aisimage.c:56:2: warning: braces around scalar initializer [enabled by default]
173aisimage.c:56:2: warning: (near initialization for 'aisimage_cmds[13]') [enabled by default]
174aisimage.c:56:2: warning: excess elements in scalar initializer [enabled by default]
175aisimage.c:56:2: warning: (near initialization for 'aisimage_cmds[13]') [enabled by default]
176aisimage.c:56:2: warning: excess elements in scalar initializer [enabled by default]
177aisimage.c:56:2: warning: (near initialization for 'aisimage_cmds[13]') [enabled by default]
178aisimage.c:57:2: warning: braces around scalar initializer [enabled by default]
179aisimage.c:57:2: warning: (near initialization for 'aisimage_cmds[14]') [enabled by default]
180aisimage.c:57:2: warning: excess elements in scalar initializer [enabled by default]
181aisimage.c:57:2: warning: (near initialization for 'aisimage_cmds[14]') [enabled by default]
182aisimage.c:57:2: warning: excess elements in scalar initializer [enabled by default]
183aisimage.c:57:2: warning: (near initialization for 'aisimage_cmds[14]') [enabled by default]
184aisimage.c:58:2: warning: braces around scalar initializer [enabled by default]
185aisimage.c:58:2: warning: (near initialization for 'aisimage_cmds[15]') [enabled by default]
186aisimage.c:58:2: warning: excess elements in scalar initializer [enabled by default]
187aisimage.c:58:2: warning: (near initialization for 'aisimage_cmds[15]') [enabled by default]
188aisimage.c:58:2: warning: excess elements in scalar initializer [enabled by default]
189aisimage.c:58:2: warning: (near initialization for 'aisimage_cmds[15]') [enabled by default]
190aisimage.c:59:2: warning: braces around scalar initializer [enabled by default]
191aisimage.c:59:2: warning: (near initialization for 'aisimage_cmds[16]') [enabled by default]
192aisimage.c:59:2: warning: excess elements in scalar initializer [enabled by default]
193aisimage.c:59:2: warning: (near initialization for 'aisimage_cmds[16]') [enabled by default]
194aisimage.c:59:2: warning: excess elements in scalar initializer [enabled by default]
195aisimage.c:59:2: warning: (near initialization for 'aisimage_cmds[16]') [enabled by default]
196aisimage.c:60:2: warning: braces around scalar initializer [enabled by default]
197aisimage.c:60:2: warning: (near initialization for 'aisimage_cmds[17]') [enabled by default]
198aisimage.c:60:2: warning: excess elements in scalar initializer [enabled by default]
199aisimage.c:60:2: warning: (near initialization for 'aisimage_cmds[17]') [enabled by default]
200aisimage.c:60:2: warning: excess elements in scalar initializer [enabled by default]
201aisimage.c:60:2: warning: (near initialization for 'aisimage_cmds[17]') [enabled by default]
202aisimage.c:61:2: warning: braces around scalar initializer [enabled by default]
203aisimage.c:61:2: warning: (near initialization for 'aisimage_cmds[18]') [enabled by default]
204aisimage.c:61:2: warning: excess elements in scalar initializer [enabled by default]
205aisimage.c:61:2: warning: (near initialization for 'aisimage_cmds[18]') [enabled by default]
206aisimage.c:61:2: warning: excess elements in scalar initializer [enabled by default]
207aisimage.c:61:2: warning: (near initialization for 'aisimage_cmds[18]') [enabled by default]
208aisimage.c: In function 'aisimage_print_header':
209aisimage.c:171:4: warning: implicit declaration of function 'get_table_entry_name' [-Wimplicit-function-declaration]
210aisimage.c:171:4: warning: format '%s' expects argument of type 'char *', but argument 3 has type 'int' [-Wformat]
211aisimage.c: In function 'aisimage_generate':
212aisimage.c:337:5: warning: implicit declaration of function 'get_table_entry_id' [-Wimplicit-function-declaration]
213aisimage.c:355:25: error: request for member 'sname' in something not a structure or union
214aisimage.c: In function 'aisimage_check_image_types':
215aisimage.c:386:14: error: 'IH_TYPE_AISIMAGE' undeclared (first use in this function)
216aisimage.c:386:14: note: each undeclared identifier is reported only once for each function it appears in
217aisimage.c:390:1: warning: control reaches end of non-void function [-Wreturn-type]
218make[5]: *** [aisimage.o] Error 1
219make[5]: Leaving directory `/build/horstbox/pro/herta/openwrt.svn/build_dir/host/u-boot-2012.04.01/tools'
220make[4]: *** [tools] Error 2
221make[4]: Leaving directory `/build/horstbox/pro/herta/openwrt.svn/build_dir/host/u-boot-2012.04.01'
222make[3]: *** [/build/horstbox/pro/herta/openwrt.svn/build_dir/host/u-boot-2012.04.01/.built] Error 2
223make[3]: Leaving directory `/build/horstbox/pro/herta/openwrt.svn/tools/mkimage'
224make[2]: *** [tools/mkimage/compile] Error 2
225make[2]: Leaving directory `/build/horstbox/pro/herta/openwrt.svn'
226make[1]: *** [/build/horstbox/pro/herta/openwrt.svn/staging_dir/target-mipsel-openwrt-linux-uclibc/stamp/.tools_install_nnnnn] Error 2
227make[1]: Leaving directory `/build/horstbox/pro/herta/openwrt.svn'
228make: *** [world] Fehler 2