Ticket #10856: config.log

File config.log, 40.8 KB (added by Christophe Nowicki <cscm@…>, 6 years ago)
Line 
1This file contains any messages produced by compilers while
2running configure, to aid debugging if configure makes a mistake.
3
4It was created by GRUB configure 0.97, which was
5generated by GNU Autoconf 2.59.  Invocation command line was
6
7  $ ./configure CFLAGS=-O2 -I/home/cscm/openwrt/trunk/staging_dir/host/include -fno-stack-protector -U_FORTIFY_SOURCE CPPFLAGS=-O2 -I/home/cscm/openwrt/trunk/staging_dir/host/include -fno-stack-protector -U_FORTIFY_SOURCE LDFLAGS=-L/home/cscm/openwrt/trunk/staging_dir/host/lib SHELL=/bin/bash grub_cv_prog_objcopy_absolute=yes --target=x86_64-linux-gnu --host=x86_64-linux-gnu --build=x86_64-linux-gnu --program-prefix= --program-suffix= --prefix=/home/cscm/openwrt/trunk/staging_dir/host --exec-prefix=/home/cscm/openwrt/trunk/staging_dir/host --sysconfdir=/home/cscm/openwrt/trunk/staging_dir/host/etc --localstatedir=/home/cscm/openwrt/trunk/staging_dir/host/var --disable-auto-linux-mem-opt --disable-hercules --without-curses --sbindir=/home/cscm/openwrt/trunk/staging_dir/host/bin --disable-graphics build_alias=x86_64-linux-gnu host_alias=x86_64-linux-gnu target_alias=x86_64-linux-gnu --no-create --no-recursion
8
9## --------- ##
10## Platform. ##
11## --------- ##
12
13hostname = nux
14uname -m = x86_64
15uname -r = 3.1.0-1-amd64
16uname -s = Linux
17uname -v = #1 SMP Tue Jan 10 05:01:58 UTC 2012
18
19/usr/bin/uname -p = unknown
20/bin/uname -X     = unknown
21
22/bin/arch              = unknown
23/usr/bin/arch -k       = unknown
24/usr/convex/getsysinfo = unknown
25hostinfo               = unknown
26/bin/machine           = unknown
27/usr/bin/oslevel       = unknown
28/bin/universe          = unknown
29
30PATH: /home/cscm/openwrt/trunk/staging_dir/toolchain-i386_gcc-4.5-linaro_uClibc-0.9.32/bin
31PATH: /home/cscm/openwrt/trunk/staging_dir/host/bin
32PATH: /home/cscm/openwrt/trunk/staging_dir/toolchain-i386_gcc-4.5-linaro_uClibc-0.9.32/bin
33PATH: /home/cscm/openwrt/trunk/staging_dir/host/bin
34PATH: /home/cscm/openwrt/trunk/staging_dir/toolchain-i386_gcc-4.5-linaro_uClibc-0.9.32/bin
35PATH: /home/cscm/openwrt/trunk/staging_dir/host/bin
36PATH: /usr/local/bin
37PATH: /usr/bin
38PATH: /bin
39PATH: /usr/local/games
40PATH: /usr/games
41
42
43## ----------- ##
44## Core tests. ##
45## ----------- ##
46
47configure:1435: checking for a BSD-compatible install
48configure:1490: result: /usr/bin/install -c
49configure:1501: checking whether build environment is sane
50configure:1544: result: yes
51configure:1609: checking for gawk
52configure:1625: found /usr/bin/gawk
53configure:1635: result: gawk
54configure:1645: checking whether make sets $(MAKE)
55configure:1665: result: yes
56configure:1840: checking build system type
57configure:1858: result: x86_64-pc-linux-gnu
58configure:1866: checking host system type
59configure:1880: result: x86_64-pc-linux-gnu
60configure:1904: checking whether to enable maintainer-specific portions of Makefiles
61configure:1913: result: no
62configure:1991: checking for x86_64-linux-gnu-gcc
63configure:2007: found /usr/bin/x86_64-linux-gnu-gcc
64configure:2017: result: x86_64-linux-gnu-gcc
65configure:2075: checking for x86_64-linux-gnu-gcc
66configure:2101: result: x86_64-linux-gnu-gcc
67configure:2383: checking for C compiler version
68configure:2386: x86_64-linux-gnu-gcc --version </dev/null >&5
69x86_64-linux-gnu-gcc (Debian 4.6.2-11) 4.6.2
70Copyright (C) 2011 Free Software Foundation, Inc.
71This is free software; see the source for copying conditions.  There is NO
72warranty; not even for MERCHANTABILITY or FITNESS FOR A PARTICULAR PURPOSE.
73
74configure:2389: $? = 0
75configure:2391: x86_64-linux-gnu-gcc -v </dev/null >&5
76Using built-in specs.
77COLLECT_GCC=x86_64-linux-gnu-gcc
78COLLECT_LTO_WRAPPER=/usr/lib/gcc/x86_64-linux-gnu/4.6/lto-wrapper
79Target: x86_64-linux-gnu
80Configured with: ../src/configure -v --with-pkgversion='Debian 4.6.2-11' --with-bugurl=file:///usr/share/doc/gcc-4.6/README.Bugs --enable-languages=c,c++,fortran,objc,obj-c++,go --prefix=/usr --program-suffix=-4.6 --enable-shared --enable-linker-build-id --with-system-zlib --libexecdir=/usr/lib --without-included-gettext --enable-threads=posix --with-gxx-include-dir=/usr/include/c++/4.6 --libdir=/usr/lib --enable-nls --enable-clocale=gnu --enable-libstdcxx-debug --enable-libstdcxx-time=yes --enable-plugin --enable-objc-gc --with-arch-32=i586 --with-tune=generic --enable-checking=release --build=x86_64-linux-gnu --host=x86_64-linux-gnu --target=x86_64-linux-gnu
81Thread model: posix
82gcc version 4.6.2 (Debian 4.6.2-11)
83configure:2394: $? = 0
84configure:2396: x86_64-linux-gnu-gcc -V </dev/null >&5
85x86_64-linux-gnu-gcc: error: unrecognized option '-V'
86x86_64-linux-gnu-gcc: fatal error: no input files
87compilation terminated.
88configure:2399: $? = 4
89configure:2422: checking for C compiler default output file name
90configure:2425: x86_64-linux-gnu-gcc -m32 -O2 -I/home/cscm/openwrt/trunk/staging_dir/host/include -fno-stack-protector -U_FORTIFY_SOURCE -O2 -I/home/cscm/openwrt/trunk/staging_dir/host/include -fno-stack-protector -U_FORTIFY_SOURCE -L/home/cscm/openwrt/trunk/staging_dir/host/lib conftest.c  >&5
91configure:2428: $? = 0
92configure:2474: result: a.out
93configure:2479: checking whether the C compiler works
94configure:2485: ./a.out
95configure:2488: $? = 0
96configure:2505: result: yes
97configure:2512: checking whether we are cross compiling
98configure:2514: result: no
99configure:2517: checking for suffix of executables
100configure:2519: x86_64-linux-gnu-gcc -o conftest -m32 -O2 -I/home/cscm/openwrt/trunk/staging_dir/host/include -fno-stack-protector -U_FORTIFY_SOURCE -O2 -I/home/cscm/openwrt/trunk/staging_dir/host/include -fno-stack-protector -U_FORTIFY_SOURCE -L/home/cscm/openwrt/trunk/staging_dir/host/lib conftest.c  >&5
101configure:2522: $? = 0
102configure:2547: result:
103configure:2553: checking for suffix of object files
104configure:2574: x86_64-linux-gnu-gcc -c -m32 -O2 -I/home/cscm/openwrt/trunk/staging_dir/host/include -fno-stack-protector -U_FORTIFY_SOURCE -O2 -I/home/cscm/openwrt/trunk/staging_dir/host/include -fno-stack-protector -U_FORTIFY_SOURCE conftest.c >&5
105configure:2577: $? = 0
106configure:2599: result: o
107configure:2603: checking whether we are using the GNU C compiler
108configure:2627: x86_64-linux-gnu-gcc -c -m32 -O2 -I/home/cscm/openwrt/trunk/staging_dir/host/include -fno-stack-protector -U_FORTIFY_SOURCE -O2 -I/home/cscm/openwrt/trunk/staging_dir/host/include -fno-stack-protector -U_FORTIFY_SOURCE conftest.c >&5
109configure:2633: $? = 0
110configure:2637: test -z
111                         || test ! -s conftest.err
112configure:2640: $? = 0
113configure:2643: test -s conftest.o
114configure:2646: $? = 0
115configure:2659: result: yes
116configure:2665: checking whether x86_64-linux-gnu-gcc accepts -g
117configure:2686: x86_64-linux-gnu-gcc -c -g -O2 -I/home/cscm/openwrt/trunk/staging_dir/host/include -fno-stack-protector -U_FORTIFY_SOURCE conftest.c >&5
118configure:2692: $? = 0
119configure:2696: test -z
120                         || test ! -s conftest.err
121configure:2699: $? = 0
122configure:2702: test -s conftest.o
123configure:2705: $? = 0
124configure:2716: result: yes
125configure:2733: checking for x86_64-linux-gnu-gcc option to accept ANSI C
126configure:2803: x86_64-linux-gnu-gcc  -c -m32 -O2 -I/home/cscm/openwrt/trunk/staging_dir/host/include -fno-stack-protector -U_FORTIFY_SOURCE -O2 -I/home/cscm/openwrt/trunk/staging_dir/host/include -fno-stack-protector -U_FORTIFY_SOURCE conftest.c >&5
127configure:2809: $? = 0
128configure:2813: test -z
129                         || test ! -s conftest.err
130configure:2816: $? = 0
131configure:2819: test -s conftest.o
132configure:2822: $? = 0
133configure:2840: result: none needed
134configure:2858: x86_64-linux-gnu-gcc -c -m32 -O2 -I/home/cscm/openwrt/trunk/staging_dir/host/include -fno-stack-protector -U_FORTIFY_SOURCE -O2 -I/home/cscm/openwrt/trunk/staging_dir/host/include -fno-stack-protector -U_FORTIFY_SOURCE conftest.c >&5
135conftest.c:2:3: error: unknown type name 'choke'
136conftest.c:2:3: error: expected '=', ',', ';', 'asm' or '__attribute__' at end of input
137configure:2864: $? = 1
138configure: failed program was:
139| #ifndef __cplusplus
140|   choke me
141| #endif
142configure:3008: checking for style of include used by make
143configure:3036: result: GNU
144configure:3064: checking dependency style of x86_64-linux-gnu-gcc
145configure:3154: result: gcc3
146configure:3175: checking dependency style of x86_64-linux-gnu-gcc
147configure:3265: result: gcc3
148configure:3339: checking for x86_64-linux-gnu-ranlib
149configure:3368: result: no
150configure:3377: checking for ranlib
151configure:3393: found /usr/bin/ranlib
152configure:3404: result: ranlib
153configure:3567: checking whether -Wundef works
154configure:3591: x86_64-linux-gnu-gcc -c -m32 -O2 -I/home/cscm/openwrt/trunk/staging_dir/host/include -fno-stack-protector -U_FORTIFY_SOURCE -Wundef conftest.c >&5
155configure:3597: $? = 0
156configure:3601: test -z
157                         || test ! -s conftest.err
158configure:3604: $? = 0
159configure:3607: test -s conftest.o
160configure:3610: $? = 0
161configure:3623: result: yes
162configure:3628: checking whether -falign-loops works
163configure:3652: x86_64-linux-gnu-gcc -c -m32 -O2 -I/home/cscm/openwrt/trunk/staging_dir/host/include -fno-stack-protector -U_FORTIFY_SOURCE -falign-loops=1 conftest.c >&5
164configure:3658: $? = 0
165configure:3662: test -z
166                         || test ! -s conftest.err
167configure:3665: $? = 0
168configure:3668: test -s conftest.o
169configure:3671: $? = 0
170configure:3684: result: yes
171configure:3743: checking for x86_64-linux-gnu-objcopy
172configure:3772: result: no
173configure:3781: checking for objcopy
174configure:3797: found /usr/bin/objcopy
175configure:3807: result: objcopy
176configure:3823: checking if C symbols get an underscore after compilation
177configure:3838: x86_64-linux-gnu-gcc -m32 -O2 -I/home/cscm/openwrt/trunk/staging_dir/host/include -fno-stack-protector -U_FORTIFY_SOURCE -S conftest.c
178configure:3841: $? = 0
179configure:3868: result: no
180configure:3871: checking whether objcopy works for absolute addresses
181configure:3933: result: yes
182configure:3942: checking whether addr32 must be in the same line as the instruction
183configure:3953: x86_64-linux-gnu-gcc -m32 -O2 -I/home/cscm/openwrt/trunk/staging_dir/host/include -fno-stack-protector -U_FORTIFY_SOURCE -c conftest.s
184configure:3956: $? = 0
185configure:3986: result: yes
186configure:3991: checking for .code16 addr32 assembler support
187configure:4008: x86_64-linux-gnu-gcc -m32 -O2 -I/home/cscm/openwrt/trunk/staging_dir/host/include -fno-stack-protector -U_FORTIFY_SOURCE -c conftest.s
188configure:4011: $? = 0
189configure:4022: result: yes
190configure:4031: checking whether an absolute indirect call/jump must not be prefixed with an asterisk
191configure:4044: x86_64-linux-gnu-gcc -m32 -O2 -I/home/cscm/openwrt/trunk/staging_dir/host/include -fno-stack-protector -U_FORTIFY_SOURCE -c conftest.s
192configure:4047: $? = 0
193configure:4066: result: no
194configure:4070: checking if start is defined by the compiler
195configure:4091: x86_64-linux-gnu-gcc -o conftest -m32 -O2 -I/home/cscm/openwrt/trunk/staging_dir/host/include -fno-stack-protector -U_FORTIFY_SOURCE -O2 -I/home/cscm/openwrt/trunk/staging_dir/host/include -fno-stack-protector -U_FORTIFY_SOURCE -Wall -Wmissing-prototypes -Wunused -Wshadow -Wpointer-arith -falign-jumps=1 -falign-loops=1 -falign-functions=1 -Wundef -L/home/cscm/openwrt/trunk/staging_dir/host/lib conftest.c  >&5
196/tmp/ccYq86Oi.o: In function `main':
197conftest.c:(.text.startup+0x2): undefined reference to `start'
198collect2: ld returned 1 exit status
199configure:4097: $? = 1
200configure: failed program was:
201| /* confdefs.h.  */
202|
203| #define PACKAGE_NAME "GRUB"
204| #define PACKAGE_TARNAME "grub"
205| #define PACKAGE_VERSION "0.97"
206| #define PACKAGE_STRING "GRUB 0.97"
207| #define PACKAGE_BUGREPORT "bug-grub@gnu.org"
208| #define PACKAGE "grub"
209| #define VERSION "0.97"
210| #define ADDR32 addr32
211| #define DATA32 data32
212| /* end confdefs.h.  */
213|
214| int
215| main ()
216| {
217| asm ("incl start")
218|   ;
219|   return 0;
220| }
221configure:4132: result: no
222configure:4136: checking if _start is defined by the compiler
223configure:4157: x86_64-linux-gnu-gcc -o conftest -m32 -O2 -I/home/cscm/openwrt/trunk/staging_dir/host/include -fno-stack-protector -U_FORTIFY_SOURCE -O2 -I/home/cscm/openwrt/trunk/staging_dir/host/include -fno-stack-protector -U_FORTIFY_SOURCE -Wall -Wmissing-prototypes -Wunused -Wshadow -Wpointer-arith -falign-jumps=1 -falign-loops=1 -falign-functions=1 -Wundef -L/home/cscm/openwrt/trunk/staging_dir/host/lib conftest.c  >&5
224configure:4163: $? = 0
225configure:4167: test -z
226                         || test ! -s conftest.err
227configure:4170: $? = 0
228configure:4173: test -s conftest
229configure:4176: $? = 0
230configure:4198: result: yes
231configure:4209: checking if __bss_start is defined by the compiler
232configure:4230: x86_64-linux-gnu-gcc -o conftest -m32 -O2 -I/home/cscm/openwrt/trunk/staging_dir/host/include -fno-stack-protector -U_FORTIFY_SOURCE -O2 -I/home/cscm/openwrt/trunk/staging_dir/host/include -fno-stack-protector -U_FORTIFY_SOURCE -Wall -Wmissing-prototypes -Wunused -Wshadow -Wpointer-arith -falign-jumps=1 -falign-loops=1 -falign-functions=1 -Wundef -L/home/cscm/openwrt/trunk/staging_dir/host/lib conftest.c  >&5
233configure:4236: $? = 0
234configure:4240: test -z
235                         || test ! -s conftest.err
236configure:4243: $? = 0
237configure:4246: test -s conftest
238configure:4249: $? = 0
239configure:4271: result: yes
240configure:4275: checking if _edata is defined by the compiler
241configure:4296: x86_64-linux-gnu-gcc -o conftest -m32 -O2 -I/home/cscm/openwrt/trunk/staging_dir/host/include -fno-stack-protector -U_FORTIFY_SOURCE -O2 -I/home/cscm/openwrt/trunk/staging_dir/host/include -fno-stack-protector -U_FORTIFY_SOURCE -Wall -Wmissing-prototypes -Wunused -Wshadow -Wpointer-arith -falign-jumps=1 -falign-loops=1 -falign-functions=1 -Wundef -L/home/cscm/openwrt/trunk/staging_dir/host/lib conftest.c  >&5
242configure:4302: $? = 0
243configure:4306: test -z
244                         || test ! -s conftest.err
245configure:4309: $? = 0
246configure:4312: test -s conftest
247configure:4315: $? = 0
248configure:4337: result: yes
249configure:4341: checking if edata is defined by the compiler
250configure:4362: x86_64-linux-gnu-gcc -o conftest -m32 -O2 -I/home/cscm/openwrt/trunk/staging_dir/host/include -fno-stack-protector -U_FORTIFY_SOURCE -O2 -I/home/cscm/openwrt/trunk/staging_dir/host/include -fno-stack-protector -U_FORTIFY_SOURCE -Wall -Wmissing-prototypes -Wunused -Wshadow -Wpointer-arith -falign-jumps=1 -falign-loops=1 -falign-functions=1 -Wundef -L/home/cscm/openwrt/trunk/staging_dir/host/lib conftest.c  >&5
251configure:4368: $? = 0
252configure:4372: test -z
253                         || test ! -s conftest.err
254configure:4375: $? = 0
255configure:4378: test -s conftest
256configure:4381: $? = 0
257configure:4403: result: yes
258configure:4415: checking if end is defined by the compiler
259configure:4436: x86_64-linux-gnu-gcc -o conftest -m32 -O2 -I/home/cscm/openwrt/trunk/staging_dir/host/include -fno-stack-protector -U_FORTIFY_SOURCE -O2 -I/home/cscm/openwrt/trunk/staging_dir/host/include -fno-stack-protector -U_FORTIFY_SOURCE -Wall -Wmissing-prototypes -Wunused -Wshadow -Wpointer-arith -falign-jumps=1 -falign-loops=1 -falign-functions=1 -Wundef -L/home/cscm/openwrt/trunk/staging_dir/host/lib conftest.c  >&5
260configure:4442: $? = 0
261configure:4446: test -z
262                         || test ! -s conftest.err
263configure:4449: $? = 0
264configure:4452: test -s conftest
265configure:4455: $? = 0
266configure:4477: result: yes
267configure:4481: checking if _end is defined by the compiler
268configure:4502: x86_64-linux-gnu-gcc -o conftest -m32 -O2 -I/home/cscm/openwrt/trunk/staging_dir/host/include -fno-stack-protector -U_FORTIFY_SOURCE -O2 -I/home/cscm/openwrt/trunk/staging_dir/host/include -fno-stack-protector -U_FORTIFY_SOURCE -Wall -Wmissing-prototypes -Wunused -Wshadow -Wpointer-arith -falign-jumps=1 -falign-loops=1 -falign-functions=1 -Wundef -L/home/cscm/openwrt/trunk/staging_dir/host/lib conftest.c  >&5
269configure:4508: $? = 0
270configure:4512: test -z
271                         || test ! -s conftest.err
272configure:4515: $? = 0
273configure:4518: test -s conftest
274configure:4521: $? = 0
275configure:4543: result: yes
276configure:4563: checking for opendisk in -lutil
277configure:4593: x86_64-linux-gnu-gcc -o conftest -m32 -O2 -I/home/cscm/openwrt/trunk/staging_dir/host/include -fno-stack-protector -U_FORTIFY_SOURCE -O2 -I/home/cscm/openwrt/trunk/staging_dir/host/include -fno-stack-protector -U_FORTIFY_SOURCE -Wall -Wmissing-prototypes -Wunused -Wshadow -Wpointer-arith -falign-jumps=1 -falign-loops=1 -falign-functions=1 -Wundef -L/home/cscm/openwrt/trunk/staging_dir/host/lib conftest.c -lutil   >&5
278/tmp/ccLbkJ6D.o: In function `main':
279conftest.c:(.text.startup+0x7): undefined reference to `opendisk'
280collect2: ld returned 1 exit status
281configure:4599: $? = 1
282configure: failed program was:
283| /* confdefs.h.  */
284|
285| #define PACKAGE_NAME "GRUB"
286| #define PACKAGE_TARNAME "grub"
287| #define PACKAGE_VERSION "0.97"
288| #define PACKAGE_STRING "GRUB 0.97"
289| #define PACKAGE_BUGREPORT "bug-grub@gnu.org"
290| #define PACKAGE "grub"
291| #define VERSION "0.97"
292| #define ADDR32 addr32
293| #define DATA32 data32
294| #define HAVE_USCORE_START_SYMBOL 1
295| #define HAVE_USCORE_USCORE_BSS_START_SYMBOL 1
296| #define HAVE_USCORE_EDATA_SYMBOL 1
297| #define HAVE_EDATA_SYMBOL 1
298| #define HAVE_END_SYMBOL 1
299| #define HAVE_USCORE_END_SYMBOL 1
300| /* end confdefs.h.  */
301|
302| /* Override any gcc2 internal prototype to avoid an error.  */
303| #ifdef __cplusplus
304| extern "C"
305| #endif
306| /* We use char because int might match the return type of a gcc2
307|    builtin and then its argument prototype would still apply.  */
308| char opendisk ();
309| int
310| main ()
311| {
312| opendisk ();
313|   ;
314|   return 0;
315| }
316configure:4625: result: no
317configure:4796: checking how to run the C preprocessor
318configure:4831: x86_64-linux-gnu-gcc -E -O2 -I/home/cscm/openwrt/trunk/staging_dir/host/include -fno-stack-protector -U_FORTIFY_SOURCE -Wall -Wmissing-prototypes -Wunused -Wshadow -Wpointer-arith -falign-jumps=1 -falign-loops=1 -falign-functions=1 -Wundef conftest.c
319configure:4837: $? = 0
320configure:4869: x86_64-linux-gnu-gcc -E -O2 -I/home/cscm/openwrt/trunk/staging_dir/host/include -fno-stack-protector -U_FORTIFY_SOURCE -Wall -Wmissing-prototypes -Wunused -Wshadow -Wpointer-arith -falign-jumps=1 -falign-loops=1 -falign-functions=1 -Wundef conftest.c
321conftest.c:19:28: fatal error: ac_nonexistent.h: No such file or directory
322compilation terminated.
323configure:4875: $? = 1
324configure: failed program was:
325| /* confdefs.h.  */
326|
327| #define PACKAGE_NAME "GRUB"
328| #define PACKAGE_TARNAME "grub"
329| #define PACKAGE_VERSION "0.97"
330| #define PACKAGE_STRING "GRUB 0.97"
331| #define PACKAGE_BUGREPORT "bug-grub@gnu.org"
332| #define PACKAGE "grub"
333| #define VERSION "0.97"
334| #define ADDR32 addr32
335| #define DATA32 data32
336| #define HAVE_USCORE_START_SYMBOL 1
337| #define HAVE_USCORE_USCORE_BSS_START_SYMBOL 1
338| #define HAVE_USCORE_EDATA_SYMBOL 1
339| #define HAVE_EDATA_SYMBOL 1
340| #define HAVE_END_SYMBOL 1
341| #define HAVE_USCORE_END_SYMBOL 1
342| /* end confdefs.h.  */
343| #include <ac_nonexistent.h>
344configure:4914: result: x86_64-linux-gnu-gcc -E
345configure:4938: x86_64-linux-gnu-gcc -E -O2 -I/home/cscm/openwrt/trunk/staging_dir/host/include -fno-stack-protector -U_FORTIFY_SOURCE -Wall -Wmissing-prototypes -Wunused -Wshadow -Wpointer-arith -falign-jumps=1 -falign-loops=1 -falign-functions=1 -Wundef conftest.c
346configure:4944: $? = 0
347configure:4976: x86_64-linux-gnu-gcc -E -O2 -I/home/cscm/openwrt/trunk/staging_dir/host/include -fno-stack-protector -U_FORTIFY_SOURCE -Wall -Wmissing-prototypes -Wunused -Wshadow -Wpointer-arith -falign-jumps=1 -falign-loops=1 -falign-functions=1 -Wundef conftest.c
348conftest.c:19:28: fatal error: ac_nonexistent.h: No such file or directory
349compilation terminated.
350configure:4982: $? = 1
351configure: failed program was:
352| /* confdefs.h.  */
353|
354| #define PACKAGE_NAME "GRUB"
355| #define PACKAGE_TARNAME "grub"
356| #define PACKAGE_VERSION "0.97"
357| #define PACKAGE_STRING "GRUB 0.97"
358| #define PACKAGE_BUGREPORT "bug-grub@gnu.org"
359| #define PACKAGE "grub"
360| #define VERSION "0.97"
361| #define ADDR32 addr32
362| #define DATA32 data32
363| #define HAVE_USCORE_START_SYMBOL 1
364| #define HAVE_USCORE_USCORE_BSS_START_SYMBOL 1
365| #define HAVE_USCORE_EDATA_SYMBOL 1
366| #define HAVE_EDATA_SYMBOL 1
367| #define HAVE_END_SYMBOL 1
368| #define HAVE_USCORE_END_SYMBOL 1
369| /* end confdefs.h.  */
370| #include <ac_nonexistent.h>
371configure:5026: checking for egrep
372configure:5036: result: grep -E
373configure:5041: checking for ANSI C header files
374configure:5066: x86_64-linux-gnu-gcc -c -m32 -O2 -I/home/cscm/openwrt/trunk/staging_dir/host/include -fno-stack-protector -U_FORTIFY_SOURCE -O2 -I/home/cscm/openwrt/trunk/staging_dir/host/include -fno-stack-protector -U_FORTIFY_SOURCE -Wall -Wmissing-prototypes -Wunused -Wshadow -Wpointer-arith -falign-jumps=1 -falign-loops=1 -falign-functions=1 -Wundef conftest.c >&5
375configure:5072: $? = 0
376configure:5076: test -z
377                         || test ! -s conftest.err
378configure:5079: $? = 0
379configure:5082: test -s conftest.o
380configure:5085: $? = 0
381configure:5174: x86_64-linux-gnu-gcc -o conftest -m32 -O2 -I/home/cscm/openwrt/trunk/staging_dir/host/include -fno-stack-protector -U_FORTIFY_SOURCE -O2 -I/home/cscm/openwrt/trunk/staging_dir/host/include -fno-stack-protector -U_FORTIFY_SOURCE -Wall -Wmissing-prototypes -Wunused -Wshadow -Wpointer-arith -falign-jumps=1 -falign-loops=1 -falign-functions=1 -Wundef -L/home/cscm/openwrt/trunk/staging_dir/host/lib conftest.c  >&5
382conftest.c: In function 'main':
383conftest.c:36:7: warning: implicit declaration of function 'exit' [-Wimplicit-function-declaration]
384conftest.c:36:7: warning: incompatible implicit declaration of built-in function 'exit' [enabled by default]
385configure:5177: $? = 0
386configure:5179: ./conftest
387configure:5182: $? = 0
388configure:5197: result: yes
389configure:5221: checking for sys/types.h
390configure:5237: x86_64-linux-gnu-gcc -c -m32 -O2 -I/home/cscm/openwrt/trunk/staging_dir/host/include -fno-stack-protector -U_FORTIFY_SOURCE -O2 -I/home/cscm/openwrt/trunk/staging_dir/host/include -fno-stack-protector -U_FORTIFY_SOURCE -Wall -Wmissing-prototypes -Wunused -Wshadow -Wpointer-arith -falign-jumps=1 -falign-loops=1 -falign-functions=1 -Wundef conftest.c >&5
391conftest.c:21:5: warning: "HAVE_SYS_TYPES_H" is not defined [-Wundef]
392conftest.c:24:5: warning: "HAVE_SYS_STAT_H" is not defined [-Wundef]
393conftest.c:35:5: warning: "HAVE_STRING_H" is not defined [-Wundef]
394conftest.c:41:5: warning: "HAVE_STRINGS_H" is not defined [-Wundef]
395conftest.c:44:5: warning: "HAVE_INTTYPES_H" is not defined [-Wundef]
396conftest.c:47:6: warning: "HAVE_STDINT_H" is not defined [-Wundef]
397conftest.c:51:5: warning: "HAVE_UNISTD_H" is not defined [-Wundef]
398configure:5243: $? = 0
399configure:5247: test -z
400                         || test ! -s conftest.err
401configure:5250: $? = 0
402configure:5253: test -s conftest.o
403configure:5256: $? = 0
404configure:5267: result: yes
405configure:5221: checking for sys/stat.h
406configure:5237: x86_64-linux-gnu-gcc -c -m32 -O2 -I/home/cscm/openwrt/trunk/staging_dir/host/include -fno-stack-protector -U_FORTIFY_SOURCE -O2 -I/home/cscm/openwrt/trunk/staging_dir/host/include -fno-stack-protector -U_FORTIFY_SOURCE -Wall -Wmissing-prototypes -Wunused -Wshadow -Wpointer-arith -falign-jumps=1 -falign-loops=1 -falign-functions=1 -Wundef conftest.c >&5
407conftest.c:25:5: warning: "HAVE_SYS_STAT_H" is not defined [-Wundef]
408conftest.c:36:5: warning: "HAVE_STRING_H" is not defined [-Wundef]
409conftest.c:42:5: warning: "HAVE_STRINGS_H" is not defined [-Wundef]
410conftest.c:45:5: warning: "HAVE_INTTYPES_H" is not defined [-Wundef]
411conftest.c:48:6: warning: "HAVE_STDINT_H" is not defined [-Wundef]
412conftest.c:52:5: warning: "HAVE_UNISTD_H" is not defined [-Wundef]
413configure:5243: $? = 0
414configure:5247: test -z
415                         || test ! -s conftest.err
416configure:5250: $? = 0
417configure:5253: test -s conftest.o
418configure:5256: $? = 0
419configure:5267: result: yes
420configure:5221: checking for stdlib.h
421configure:5237: x86_64-linux-gnu-gcc -c -m32 -O2 -I/home/cscm/openwrt/trunk/staging_dir/host/include -fno-stack-protector -U_FORTIFY_SOURCE -O2 -I/home/cscm/openwrt/trunk/staging_dir/host/include -fno-stack-protector -U_FORTIFY_SOURCE -Wall -Wmissing-prototypes -Wunused -Wshadow -Wpointer-arith -falign-jumps=1 -falign-loops=1 -falign-functions=1 -Wundef conftest.c >&5
422conftest.c:37:5: warning: "HAVE_STRING_H" is not defined [-Wundef]
423conftest.c:43:5: warning: "HAVE_STRINGS_H" is not defined [-Wundef]
424conftest.c:46:5: warning: "HAVE_INTTYPES_H" is not defined [-Wundef]
425conftest.c:49:6: warning: "HAVE_STDINT_H" is not defined [-Wundef]
426conftest.c:53:5: warning: "HAVE_UNISTD_H" is not defined [-Wundef]
427configure:5243: $? = 0
428configure:5247: test -z
429                         || test ! -s conftest.err
430configure:5250: $? = 0
431configure:5253: test -s conftest.o
432configure:5256: $? = 0
433configure:5267: result: yes
434configure:5221: checking for string.h
435configure:5237: x86_64-linux-gnu-gcc -c -m32 -O2 -I/home/cscm/openwrt/trunk/staging_dir/host/include -fno-stack-protector -U_FORTIFY_SOURCE -O2 -I/home/cscm/openwrt/trunk/staging_dir/host/include -fno-stack-protector -U_FORTIFY_SOURCE -Wall -Wmissing-prototypes -Wunused -Wshadow -Wpointer-arith -falign-jumps=1 -falign-loops=1 -falign-functions=1 -Wundef conftest.c >&5
436conftest.c:38:5: warning: "HAVE_STRING_H" is not defined [-Wundef]
437conftest.c:44:5: warning: "HAVE_STRINGS_H" is not defined [-Wundef]
438conftest.c:47:5: warning: "HAVE_INTTYPES_H" is not defined [-Wundef]
439conftest.c:50:6: warning: "HAVE_STDINT_H" is not defined [-Wundef]
440conftest.c:54:5: warning: "HAVE_UNISTD_H" is not defined [-Wundef]
441configure:5243: $? = 0
442configure:5247: test -z
443                         || test ! -s conftest.err
444configure:5250: $? = 0
445configure:5253: test -s conftest.o
446configure:5256: $? = 0
447configure:5267: result: yes
448configure:5221: checking for memory.h
449configure:5237: x86_64-linux-gnu-gcc -c -m32 -O2 -I/home/cscm/openwrt/trunk/staging_dir/host/include -fno-stack-protector -U_FORTIFY_SOURCE -O2 -I/home/cscm/openwrt/trunk/staging_dir/host/include -fno-stack-protector -U_FORTIFY_SOURCE -Wall -Wmissing-prototypes -Wunused -Wshadow -Wpointer-arith -falign-jumps=1 -falign-loops=1 -falign-functions=1 -Wundef conftest.c >&5
450conftest.c:45:5: warning: "HAVE_STRINGS_H" is not defined [-Wundef]
451conftest.c:48:5: warning: "HAVE_INTTYPES_H" is not defined [-Wundef]
452conftest.c:51:6: warning: "HAVE_STDINT_H" is not defined [-Wundef]
453conftest.c:55:5: warning: "HAVE_UNISTD_H" is not defined [-Wundef]
454configure:5243: $? = 0
455configure:5247: test -z
456                         || test ! -s conftest.err
457configure:5250: $? = 0
458configure:5253: test -s conftest.o
459configure:5256: $? = 0
460configure:5267: result: yes
461configure:5221: checking for strings.h
462configure:5237: x86_64-linux-gnu-gcc -c -m32 -O2 -I/home/cscm/openwrt/trunk/staging_dir/host/include -fno-stack-protector -U_FORTIFY_SOURCE -O2 -I/home/cscm/openwrt/trunk/staging_dir/host/include -fno-stack-protector -U_FORTIFY_SOURCE -Wall -Wmissing-prototypes -Wunused -Wshadow -Wpointer-arith -falign-jumps=1 -falign-loops=1 -falign-functions=1 -Wundef conftest.c >&5
463conftest.c:46:5: warning: "HAVE_STRINGS_H" is not defined [-Wundef]
464conftest.c:49:5: warning: "HAVE_INTTYPES_H" is not defined [-Wundef]
465conftest.c:52:6: warning: "HAVE_STDINT_H" is not defined [-Wundef]
466conftest.c:56:5: warning: "HAVE_UNISTD_H" is not defined [-Wundef]
467configure:5243: $? = 0
468configure:5247: test -z
469                         || test ! -s conftest.err
470configure:5250: $? = 0
471configure:5253: test -s conftest.o
472configure:5256: $? = 0
473configure:5267: result: yes
474configure:5221: checking for inttypes.h
475configure:5237: x86_64-linux-gnu-gcc -c -m32 -O2 -I/home/cscm/openwrt/trunk/staging_dir/host/include -fno-stack-protector -U_FORTIFY_SOURCE -O2 -I/home/cscm/openwrt/trunk/staging_dir/host/include -fno-stack-protector -U_FORTIFY_SOURCE -Wall -Wmissing-prototypes -Wunused -Wshadow -Wpointer-arith -falign-jumps=1 -falign-loops=1 -falign-functions=1 -Wundef conftest.c >&5
476conftest.c:50:5: warning: "HAVE_INTTYPES_H" is not defined [-Wundef]
477conftest.c:53:6: warning: "HAVE_STDINT_H" is not defined [-Wundef]
478conftest.c:57:5: warning: "HAVE_UNISTD_H" is not defined [-Wundef]
479configure:5243: $? = 0
480configure:5247: test -z
481                         || test ! -s conftest.err
482configure:5250: $? = 0
483configure:5253: test -s conftest.o
484configure:5256: $? = 0
485configure:5267: result: yes
486configure:5221: checking for stdint.h
487configure:5237: x86_64-linux-gnu-gcc -c -m32 -O2 -I/home/cscm/openwrt/trunk/staging_dir/host/include -fno-stack-protector -U_FORTIFY_SOURCE -O2 -I/home/cscm/openwrt/trunk/staging_dir/host/include -fno-stack-protector -U_FORTIFY_SOURCE -Wall -Wmissing-prototypes -Wunused -Wshadow -Wpointer-arith -falign-jumps=1 -falign-loops=1 -falign-functions=1 -Wundef conftest.c >&5
488conftest.c:58:5: warning: "HAVE_UNISTD_H" is not defined [-Wundef]
489configure:5243: $? = 0
490configure:5247: test -z
491                         || test ! -s conftest.err
492configure:5250: $? = 0
493configure:5253: test -s conftest.o
494configure:5256: $? = 0
495configure:5267: result: yes
496configure:5221: checking for unistd.h
497configure:5237: x86_64-linux-gnu-gcc -c -m32 -O2 -I/home/cscm/openwrt/trunk/staging_dir/host/include -fno-stack-protector -U_FORTIFY_SOURCE -O2 -I/home/cscm/openwrt/trunk/staging_dir/host/include -fno-stack-protector -U_FORTIFY_SOURCE -Wall -Wmissing-prototypes -Wunused -Wshadow -Wpointer-arith -falign-jumps=1 -falign-loops=1 -falign-functions=1 -Wundef conftest.c >&5
498conftest.c:59:5: warning: "HAVE_UNISTD_H" is not defined [-Wundef]
499configure:5243: $? = 0
500configure:5247: test -z
501                         || test ! -s conftest.err
502configure:5250: $? = 0
503configure:5253: test -s conftest.o
504configure:5256: $? = 0
505configure:5267: result: yes
506configure:5288: checking for string.h
507configure:5293: result: yes
508configure:5288: checking for strings.h
509configure:5293: result: yes
510configure:5297: checking ncurses/curses.h usability
511configure:5309: x86_64-linux-gnu-gcc -c -m32 -O2 -I/home/cscm/openwrt/trunk/staging_dir/host/include -fno-stack-protector -U_FORTIFY_SOURCE -O2 -I/home/cscm/openwrt/trunk/staging_dir/host/include -fno-stack-protector -U_FORTIFY_SOURCE -Wall -Wmissing-prototypes -Wunused -Wshadow -Wpointer-arith -falign-jumps=1 -falign-loops=1 -falign-functions=1 -Wundef conftest.c >&5
512conftest.c:65:28: fatal error: ncurses/curses.h: No such file or directory
513compilation terminated.
514configure:5315: $? = 1
515configure: failed program was:
516| /* confdefs.h.  */
517|
518| #define PACKAGE_NAME "GRUB"
519| #define PACKAGE_TARNAME "grub"
520| #define PACKAGE_VERSION "0.97"
521| #define PACKAGE_STRING "GRUB 0.97"
522| #define PACKAGE_BUGREPORT "bug-grub@gnu.org"
523| #define PACKAGE "grub"
524| #define VERSION "0.97"
525| #define ADDR32 addr32
526| #define DATA32 data32
527| #define HAVE_USCORE_START_SYMBOL 1
528| #define HAVE_USCORE_USCORE_BSS_START_SYMBOL 1
529| #define HAVE_USCORE_EDATA_SYMBOL 1
530| #define HAVE_EDATA_SYMBOL 1
531| #define HAVE_END_SYMBOL 1
532| #define HAVE_USCORE_END_SYMBOL 1
533| #define STDC_HEADERS 1
534| #define HAVE_SYS_TYPES_H 1
535| #define HAVE_SYS_STAT_H 1
536| #define HAVE_STDLIB_H 1
537| #define HAVE_STRING_H 1
538| #define HAVE_MEMORY_H 1
539| #define HAVE_STRINGS_H 1
540| #define HAVE_INTTYPES_H 1
541| #define HAVE_STDINT_H 1
542| #define HAVE_UNISTD_H 1
543| #define HAVE_STRING_H 1
544| #define HAVE_STRINGS_H 1
545| /* end confdefs.h.  */
546| #include <stdio.h>
547| #if HAVE_SYS_TYPES_H
548| # include <sys/types.h>
549| #endif
550| #if HAVE_SYS_STAT_H
551| # include <sys/stat.h>
552| #endif
553| #if STDC_HEADERS
554| # include <stdlib.h>
555| # include <stddef.h>
556| #else
557| # if HAVE_STDLIB_H
558| #  include <stdlib.h>
559| # endif
560| #endif
561| #if HAVE_STRING_H
562| # if !STDC_HEADERS && HAVE_MEMORY_H
563| #  include <memory.h>
564| # endif
565| # include <string.h>
566| #endif
567| #if HAVE_STRINGS_H
568| # include <strings.h>
569| #endif
570| #if HAVE_INTTYPES_H
571| # include <inttypes.h>
572| #else
573| # if HAVE_STDINT_H
574| #  include <stdint.h>
575| # endif
576| #endif
577| #if HAVE_UNISTD_H
578| # include <unistd.h>
579| #endif
580| #include <ncurses/curses.h>
581configure:5338: result: no
582configure:5342: checking ncurses/curses.h presence
583configure:5352: x86_64-linux-gnu-gcc -E -O2 -I/home/cscm/openwrt/trunk/staging_dir/host/include -fno-stack-protector -U_FORTIFY_SOURCE -Wall -Wmissing-prototypes -Wunused -Wshadow -Wpointer-arith -falign-jumps=1 -falign-loops=1 -falign-functions=1 -Wundef conftest.c
584conftest.c:31:28: fatal error: ncurses/curses.h: No such file or directory
585compilation terminated.
586configure:5358: $? = 1
587configure: failed program was:
588| /* confdefs.h.  */
589|
590| #define PACKAGE_NAME "GRUB"
591| #define PACKAGE_TARNAME "grub"
592| #define PACKAGE_VERSION "0.97"
593| #define PACKAGE_STRING "GRUB 0.97"
594| #define PACKAGE_BUGREPORT "bug-grub@gnu.org"
595| #define PACKAGE "grub"
596| #define VERSION "0.97"
597| #define ADDR32 addr32
598| #define DATA32 data32
599| #define HAVE_USCORE_START_SYMBOL 1
600| #define HAVE_USCORE_USCORE_BSS_START_SYMBOL 1
601| #define HAVE_USCORE_EDATA_SYMBOL 1
602| #define HAVE_EDATA_SYMBOL 1
603| #define HAVE_END_SYMBOL 1
604| #define HAVE_USCORE_END_SYMBOL 1
605| #define STDC_HEADERS 1
606| #define HAVE_SYS_TYPES_H 1
607| #define HAVE_SYS_STAT_H 1
608| #define HAVE_STDLIB_H 1
609| #define HAVE_STRING_H 1
610| #define HAVE_MEMORY_H 1
611| #define HAVE_STRINGS_H 1
612| #define HAVE_INTTYPES_H 1
613| #define HAVE_STDINT_H 1
614| #define HAVE_UNISTD_H 1
615| #define HAVE_STRING_H 1
616| #define HAVE_STRINGS_H 1
617| /* end confdefs.h.  */
618| #include <ncurses/curses.h>
619configure:5378: result: no
620configure:5413: checking for ncurses/curses.h
621configure:5420: result: no
622configure:5297: checking ncurses.h usability
623configure:5309: x86_64-linux-gnu-gcc -c -m32 -O2 -I/home/cscm/openwrt/trunk/staging_dir/host/include -fno-stack-protector -U_FORTIFY_SOURCE -O2 -I/home/cscm/openwrt/trunk/staging_dir/host/include -fno-stack-protector -U_FORTIFY_SOURCE -Wall -Wmissing-prototypes -Wunused -Wshadow -Wpointer-arith -falign-jumps=1 -falign-loops=1 -falign-functions=1 -Wundef conftest.c >&5
624configure:5315: $? = 0
625configure:5319: test -z
626                         || test ! -s conftest.err
627configure:5322: $? = 0
628configure:5325: test -s conftest.o
629configure:5328: $? = 0
630configure:5338: result: yes
631configure:5342: checking ncurses.h presence
632configure:5352: x86_64-linux-gnu-gcc -E -O2 -I/home/cscm/openwrt/trunk/staging_dir/host/include -fno-stack-protector -U_FORTIFY_SOURCE -Wall -Wmissing-prototypes -Wunused -Wshadow -Wpointer-arith -falign-jumps=1 -falign-loops=1 -falign-functions=1 -Wundef conftest.c
633configure:5358: $? = 0
634configure:5378: result: yes
635configure:5413: checking for ncurses.h
636configure:5420: result: yes
637configure:5297: checking curses.h usability
638configure:5309: x86_64-linux-gnu-gcc -c -m32 -O2 -I/home/cscm/openwrt/trunk/staging_dir/host/include -fno-stack-protector -U_FORTIFY_SOURCE -O2 -I/home/cscm/openwrt/trunk/staging_dir/host/include -fno-stack-protector -U_FORTIFY_SOURCE -Wall -Wmissing-prototypes -Wunused -Wshadow -Wpointer-arith -falign-jumps=1 -falign-loops=1 -falign-functions=1 -Wundef conftest.c >&5
639configure:5315: $? = 0
640configure:5319: test -z
641                         || test ! -s conftest.err
642configure:5322: $? = 0
643configure:5325: test -s conftest.o
644configure:5328: $? = 0
645configure:5338: result: yes
646configure:5342: checking curses.h presence
647configure:5352: x86_64-linux-gnu-gcc -E -O2 -I/home/cscm/openwrt/trunk/staging_dir/host/include -fno-stack-protector -U_FORTIFY_SOURCE -Wall -Wmissing-prototypes -Wunused -Wshadow -Wpointer-arith -falign-jumps=1 -falign-loops=1 -falign-functions=1 -Wundef conftest.c
648configure:5358: $? = 0
649configure:5378: result: yes
650configure:5413: checking for curses.h
651configure:5420: result: yes
652configure:6329: creating ./config.status
653
654## ---------------- ##
655## Cache variables. ##
656## ---------------- ##
657
658ac_cv_build=x86_64-pc-linux-gnu
659ac_cv_build_alias=x86_64-linux-gnu
660ac_cv_c_compiler_gnu=yes
661ac_cv_env_CC_set=
662ac_cv_env_CC_value=
663ac_cv_env_CFLAGS_set=set
664ac_cv_env_CFLAGS_value='-O2 -I/home/cscm/openwrt/trunk/staging_dir/host/include -fno-stack-protector -U_FORTIFY_SOURCE'
665ac_cv_env_CPPFLAGS_set=set
666ac_cv_env_CPPFLAGS_value='-O2 -I/home/cscm/openwrt/trunk/staging_dir/host/include -fno-stack-protector -U_FORTIFY_SOURCE'
667ac_cv_env_CPP_set=
668ac_cv_env_CPP_value=
669ac_cv_env_LDFLAGS_set=set
670ac_cv_env_LDFLAGS_value=-L/home/cscm/openwrt/trunk/staging_dir/host/lib
671ac_cv_env_build_alias_set=set
672ac_cv_env_build_alias_value=x86_64-linux-gnu
673ac_cv_env_host_alias_set=set
674ac_cv_env_host_alias_value=x86_64-linux-gnu
675ac_cv_env_target_alias_set=set
676ac_cv_env_target_alias_value=x86_64-linux-gnu
677ac_cv_exeext=
678ac_cv_header_curses_h=yes
679ac_cv_header_inttypes_h=yes
680ac_cv_header_memory_h=yes
681ac_cv_header_ncurses_curses_h=no
682ac_cv_header_ncurses_h=yes
683ac_cv_header_stdc=yes
684ac_cv_header_stdint_h=yes
685ac_cv_header_stdlib_h=yes
686ac_cv_header_string_h=yes
687ac_cv_header_strings_h=yes
688ac_cv_header_sys_stat_h=yes
689ac_cv_header_sys_types_h=yes
690ac_cv_header_unistd_h=yes
691ac_cv_host=x86_64-pc-linux-gnu
692ac_cv_host_alias=x86_64-linux-gnu
693ac_cv_lib_util_opendisk=no
694ac_cv_objext=o
695ac_cv_path_install='/usr/bin/install -c'
696ac_cv_prog_AWK=gawk
697ac_cv_prog_CC=x86_64-linux-gnu-gcc
698ac_cv_prog_CPP='x86_64-linux-gnu-gcc -E'
699ac_cv_prog_ac_ct_OBJCOPY=objcopy
700ac_cv_prog_ac_ct_RANLIB=ranlib
701ac_cv_prog_cc_g=yes
702ac_cv_prog_cc_stdc=
703ac_cv_prog_egrep='grep -E'
704ac_cv_prog_make_make_set=yes
705am_cv_CC_dependencies_compiler_type=gcc3
706grub_cv_asm_absolute_without_asterisk=no
707grub_cv_asm_addr32=yes
708grub_cv_asm_prefix_requirement=yes
709grub_cv_asm_uscore=no
710grub_cv_check_edata_symbol=yes
711grub_cv_check_end_symbol=yes
712grub_cv_check_start_symbol=no
713grub_cv_check_uscore_edata_symbol=yes
714grub_cv_check_uscore_end_symbol=yes
715grub_cv_check_uscore_start_symbol=yes
716grub_cv_check_uscore_uscore_bss_start_symbol=yes
717grub_cv_prog_objcopy_absolute=yes
718
719## ----------------- ##
720## Output variables. ##
721## ----------------- ##
722
723ACLOCAL='${SHELL} /home/cscm/openwrt/trunk/build_dir/host/grub-0.97/missing --run aclocal-1.9'
724AMDEPBACKSLASH='\'
725AMDEP_FALSE='#'
726AMDEP_TRUE=''
727AMTAR='${SHELL} /home/cscm/openwrt/trunk/build_dir/host/grub-0.97/missing --run tar'
728AUTOCONF='${SHELL} /home/cscm/openwrt/trunk/build_dir/host/grub-0.97/missing --run autoconf'
729AUTOHEADER='${SHELL} /home/cscm/openwrt/trunk/build_dir/host/grub-0.97/missing --run autoheader'
730AUTOMAKE='${SHELL} /home/cscm/openwrt/trunk/build_dir/host/grub-0.97/missing --run automake-1.9'
731AWK='gawk'
732BUILD_EXAMPLE_KERNEL_FALSE=''
733BUILD_EXAMPLE_KERNEL_TRUE='#'
734CC='x86_64-linux-gnu-gcc'
735CCAS='x86_64-linux-gnu-gcc'
736CCASFLAGS='$(DEFS) $(DEFAULT_INCLUDES) $(INCLUDES) $(CPPFLAGS) $(CFLAGS)'
737CCDEPMODE='depmode=gcc3'
738CFLAGS='-m32 -O2 -I/home/cscm/openwrt/trunk/staging_dir/host/include -fno-stack-protector -U_FORTIFY_SOURCE'
739CPP='x86_64-linux-gnu-gcc -E'
740CPPFLAGS='-O2 -I/home/cscm/openwrt/trunk/staging_dir/host/include -fno-stack-protector -U_FORTIFY_SOURCE -Wall -Wmissing-prototypes -Wunused -Wshadow -Wpointer-arith -falign-jumps=1 -falign-loops=1 -falign-functions=1 -Wundef'
741CYGPATH_W='echo'
742DEFS='-DHAVE_CONFIG_H'
743DEPDIR='.deps'
744DISKLESS_SUPPORT_FALSE=''
745DISKLESS_SUPPORT_TRUE='#'
746ECHO_C=''
747ECHO_N='-n'
748ECHO_T=''
749EGREP='grep -E'
750EXEEXT=''
751FSYS_CFLAGS=' -DFSYS_EXT2FS=1 -DFSYS_FAT=1 -DFSYS_FFS=1 -DFSYS_UFS2=1 -DFSYS_MINIX=1 -DFSYS_REISERFS=1 -DFSYS_VSTAFS=1 -DFSYS_JFS=1 -DFSYS_XFS=1 -DFSYS_ISO9660=1 -DUSE_MD5_PASSWORDS=1'
752GRAPHICS_SUPPORT_FALSE=''
753GRAPHICS_SUPPORT_TRUE='#'
754GRUB_CFLAGS=''
755GRUB_LIBS=''
756HERCULES_SUPPORT_FALSE=''
757HERCULES_SUPPORT_TRUE='#'
758INSTALL_DATA='${INSTALL} -m 644'
759INSTALL_PROGRAM='${INSTALL}'
760INSTALL_SCRIPT='${INSTALL}'
761INSTALL_STRIP_PROGRAM='${SHELL} $(install_sh) -c -s'
762LDFLAGS='-L/home/cscm/openwrt/trunk/staging_dir/host/lib'
763LIBOBJS=''
764LIBS=''
765LTLIBOBJS=''
766MAINT='#'
767MAINTAINER_MODE_FALSE=''
768MAINTAINER_MODE_TRUE='#'
769MAKEINFO='${SHELL} /home/cscm/openwrt/trunk/build_dir/host/grub-0.97/missing --run makeinfo'
770NETBOOT_DRIVERS=''
771NETBOOT_SUPPORT_FALSE=''
772NETBOOT_SUPPORT_TRUE='#'
773NET_CFLAGS=''
774NET_EXTRAFLAGS=' -DCONGESTED=1 -DNE_SCAN=0x280,0x300,0x320,0x340 -DWD_DEFAULT_MEM=0xCC000'
775OBJCOPY='objcopy'
776OBJEXT='o'
777PACKAGE='grub'
778PACKAGE_BUGREPORT='bug-grub@gnu.org'
779PACKAGE_NAME='GRUB'
780PACKAGE_STRING='GRUB 0.97'
781PACKAGE_TARNAME='grub'
782PACKAGE_VERSION='0.97'
783PATH_SEPARATOR=':'
784PERL=''
785RANLIB='ranlib'
786SERIAL_SPEED_SIMULATION_FALSE=''
787SERIAL_SPEED_SIMULATION_TRUE='#'
788SERIAL_SUPPORT_FALSE='#'
789SERIAL_SUPPORT_TRUE=''
790SET_MAKE=''
791SHELL='/bin/bash'
792STAGE1_CFLAGS=''
793STAGE2_CFLAGS=''
794STRIP=''
795VERSION='0.97'
796ac_ct_CC=''
797ac_ct_OBJCOPY='objcopy'
798ac_ct_RANLIB='ranlib'
799ac_ct_STRIP=''
800am__fastdepCC_FALSE='#'
801am__fastdepCC_TRUE=''
802am__include='include'
803am__leading_dot='.'
804am__quote=''
805am__tar='${AMTAR} chof - "$$tardir"'
806am__untar='${AMTAR} xf -'
807bindir='${exec_prefix}/bin'
808build='x86_64-pc-linux-gnu'
809build_alias='x86_64-linux-gnu'
810build_cpu='x86_64'
811build_os='linux-gnu'
812build_vendor='pc'
813datadir='${prefix}/share'
814exec_prefix='/home/cscm/openwrt/trunk/staging_dir/host'
815host='x86_64-pc-linux-gnu'
816host_alias='x86_64-linux-gnu'
817host_cpu='x86_64'
818host_os='linux-gnu'
819host_vendor='pc'
820includedir='${prefix}/include'
821infodir='${prefix}/info'
822install_sh='/home/cscm/openwrt/trunk/build_dir/host/grub-0.97/install-sh'
823libdir='${exec_prefix}/lib'
824libexecdir='${exec_prefix}/libexec'
825localstatedir='/home/cscm/openwrt/trunk/staging_dir/host/var'
826mandir='${prefix}/man'
827mkdir_p='mkdir -p --'
828oldincludedir='/usr/include'
829prefix='/home/cscm/openwrt/trunk/staging_dir/host'
830program_transform_name='s,$$,,;s,^,,'
831sbindir='/home/cscm/openwrt/trunk/staging_dir/host/bin'
832sharedstatedir='${prefix}/com'
833sysconfdir='/home/cscm/openwrt/trunk/staging_dir/host/etc'
834target_alias='x86_64-linux-gnu'
835
836## ----------- ##
837## confdefs.h. ##
838## ----------- ##
839
840#define ADDR32 addr32
841#define DATA32 data32
842#define HAVE_CURSES_H 1
843#define HAVE_EDATA_SYMBOL 1
844#define HAVE_END_SYMBOL 1
845#define HAVE_INTTYPES_H 1
846#define HAVE_MEMORY_H 1
847#define HAVE_NCURSES_H 1
848#define HAVE_STDINT_H 1
849#define HAVE_STDLIB_H 1
850#define HAVE_STRINGS_H 1
851#define HAVE_STRINGS_H 1
852#define HAVE_STRING_H 1
853#define HAVE_STRING_H 1
854#define HAVE_SYS_STAT_H 1
855#define HAVE_SYS_TYPES_H 1
856#define HAVE_UNISTD_H 1
857#define HAVE_USCORE_EDATA_SYMBOL 1
858#define HAVE_USCORE_END_SYMBOL 1
859#define HAVE_USCORE_START_SYMBOL 1
860#define HAVE_USCORE_USCORE_BSS_START_SYMBOL 1
861#define PACKAGE "grub"
862#define PACKAGE_BUGREPORT "bug-grub@gnu.org"
863#define PACKAGE_NAME "GRUB"
864#define PACKAGE_STRING "GRUB 0.97"
865#define PACKAGE_TARNAME "grub"
866#define PACKAGE_VERSION "0.97"
867#define STDC_HEADERS 1
868#define VERSION "0.97"
869
870configure: exit 0