Ticket #10242: compache_error.txt

File compache_error.txt, 2.8 KB (added by Txt.file, 6 years ago)

log of "make V=s"

Line 
1make[3]: Leaving directory `/media/ssd/openwrt/trunk/package/busybox'
2make[3]: Entering directory `/media/ssd/openwrt/trunk/package/compcache'
3make -C /media/ssd/openwrt/trunk/build_dir/linux-ar71xx_generic/linux-3.3.8 CROSS_COMPILE="mips-openwrt-linux-uclibc-" ARCH="mips" KBUILD_HAVE_NLS=no CONFIG_SHELL="/bin/bash" V='' EXTRA_LDSFLAGS="-I/media/ssd/openwrt/trunk/build_dir/linux-ar71xx_generic -include symtab.h" CC="mips-openwrt-linux-uclibc-gcc" EXTRA_CFLAGS="-DCONFIG_RAMZSWAP_STATS -I/media/ssd/openwrt/trunk/build_dir/linux-ar71xx_generic/compcache-0.6.2/sub-projects/compression/lzo-kmod -Wall" M="/media/ssd/openwrt/trunk/build_dir/linux-ar71xx_generic/compcache-0.6.2" modules
4make[4]: Entering directory `/media/ssd/openwrt/trunk/build_dir/linux-ar71xx_generic/linux-3.3.8'
5  CC [M]  /media/ssd/openwrt/trunk/build_dir/linux-ar71xx_generic/compcache-0.6.2/ramzswap_drv.o
6/media/ssd/openwrt/trunk/build_dir/linux-ar71xx_generic/compcache-0.6.2/ramzswap_drv.c: In function 'setup_backing_swap':
7/media/ssd/openwrt/trunk/build_dir/linux-ar71xx_generic/compcache-0.6.2/ramzswap_drv.c:528:3: error: implicit declaration of function 'bd_claim' [-Werror=implicit-function-declaration]
8/media/ssd/openwrt/trunk/build_dir/linux-ar71xx_generic/compcache-0.6.2/ramzswap_drv.c:560:3: error: implicit declaration of function 'bd_release' [-Werror=implicit-function-declaration]
9/media/ssd/openwrt/trunk/build_dir/linux-ar71xx_generic/compcache-0.6.2/ramzswap_drv.c: In function 'create_device':
10/media/ssd/openwrt/trunk/build_dir/linux-ar71xx_generic/compcache-0.6.2/ramzswap_drv.c:1370:2: warning: passing argument 2 of 'blk_queue_make_request' from incompatible pointer type [enabled by default]
11In file included from /media/ssd/openwrt/trunk/build_dir/linux-ar71xx_generic/compcache-0.6.2/ramzswap_drv.c:21:0:
12include/linux/blkdev.h:827:13: note: expected 'void (*)(struct request_queue *, struct bio *)' but argument is of type 'int (*)(struct request_queue *, struct bio *)'
13cc1: some warnings being treated as errors
14make[5]: *** [/media/ssd/openwrt/trunk/build_dir/linux-ar71xx_generic/compcache-0.6.2/ramzswap_drv.o] Error 1
15make[4]: *** [_module_/media/ssd/openwrt/trunk/build_dir/linux-ar71xx_generic/compcache-0.6.2] Error 2
16make[4]: Leaving directory `/media/ssd/openwrt/trunk/build_dir/linux-ar71xx_generic/linux-3.3.8'
17make[3]: *** [/media/ssd/openwrt/trunk/build_dir/linux-ar71xx_generic/compcache-0.6.2/.built] Error 2
18make[3]: Leaving directory `/media/ssd/openwrt/trunk/package/compcache'
19make[2]: *** [package/compcache/compile] Error 2
20make[2]: Leaving directory `/media/ssd/openwrt/trunk'
21make[1]: *** [/media/ssd/openwrt/trunk/staging_dir/target-mips_r2_uClibc-0.9.33.2/stamp/.package_compile] Error 2
22make[1]: Leaving directory `/media/ssd/openwrt/trunk'
23make: *** [world] Error 2
24user@host:/path/to/folder$